BDBM50057911 4-[2-(4-Chloro-3-methoxy-phenyl)-4-trifluoromethyl-imidazol-1-yl]-benzenesulfonamide::CHEMBL289561
SMILES: COc1cc(ccc1Cl)-c1nc(cn1-c1ccc(cc1)S(N)(=O)=O)C(F)(F)F
InChI Key: InChIKey=KLQYRGLUEBNTQS-UHFFFAOYSA-N
Data: 3 IC50
Activity Spreadsheet -- Enzyme Inhibition Constant Data from BindingDB
Found 3 hits for monomerid = 50057911
Trg + Lig
Ki
nM
ΔG°
kcal/mole
IC50
nM
Kd
nM
EC50/IC50
nM
koff
s-1
kon
M-1s-1
pHTemp
°C
Prostaglandin G/H synthase 1
(Homo sapiens (Human))
BDBM50057911
(4-[2-(4-Chloro-3-methoxy-phenyl)-4-trifluoromethyl...)
Show SMILES COc1cc(ccc1Cl)-c1nc(cn1-c1ccc(cc1)S(N)(=O)=O)C(F)(F)F
Show InChI InChI=1S/C17H13ClF3N3O3S/c1-27-14-8-10(2-7-13(14)18)16-23-15(17(19,20)21)9-24(16)11-3-5-12(6-4-11)28(22,25)26/h2-9H,1H3,(H2,22,25,26)
n/an/a 8.60E+3n/an/an/an/an/an/a
Searle Research and Development
Curated by ChEMBL
Assay Description
Concentration required to inhibit human prostaglandin G/H synthase 1 (COX-1) by 50%
J Med Chem 40: 1634-47 (1997)
Article DOI: 10.1021/jm9700225
BindingDB Entry DOI: 10.7270/Q2F76BN0
Prostaglandin G/H synthase 2
(Homo sapiens (Human))
BDBM50057911
(4-[2-(4-Chloro-3-methoxy-phenyl)-4-trifluoromethyl...)
Show SMILES COc1cc(ccc1Cl)-c1nc(cn1-c1ccc(cc1)S(N)(=O)=O)C(F)(F)F
Show InChI InChI=1S/C17H13ClF3N3O3S/c1-27-14-8-10(2-7-13(14)18)16-23-15(17(19,20)21)9-24(16)11-3-5-12(6-4-11)28(22,25)26/h2-9H,1H3,(H2,22,25,26)
NCI pathway
Reactome pathway
n/an/a 19.9n/an/an/an/an/an/a
Universit£ de Lille 2
Curated by ChEMBL
Assay Description
Inhibition of human Prostaglandin G/H synthase 2
J Med Chem 44: 3223-30 (2001)
BindingDB Entry DOI: 10.7270/Q2736S4D
Prostaglandin G/H synthase 2
(Homo sapiens (Human))
BDBM50057911
(4-[2-(4-Chloro-3-methoxy-phenyl)-4-trifluoromethyl...)
Show SMILES COc1cc(ccc1Cl)-c1nc(cn1-c1ccc(cc1)S(N)(=O)=O)C(F)(F)F
Show InChI InChI=1S/C17H13ClF3N3O3S/c1-27-14-8-10(2-7-13(14)18)16-23-15(17(19,20)21)9-24(16)11-3-5-12(6-4-11)28(22,25)26/h2-9H,1H3,(H2,22,25,26)
NCI pathway
Reactome pathway
n/an/a 20n/an/an/an/an/an/a
Searle Research and Development
Curated by ChEMBL
Assay Description
Concentration required to inhibit human Prostaglandin G/H synthase 2 (COX-2) by 50%
J Med Chem 40: 1634-47 (1997)
Article DOI: 10.1021/jm9700225
BindingDB Entry DOI: 10.7270/Q2F76BN0