BDBM50058524 CHEMBL3326739
SMILES: Brc1cc2c(Nc3ccncc3)ncnn2c1
InChI Key: InChIKey=RBZZCNGZQAMXTN-UHFFFAOYSA-N
Data: 1 IC50
Activity Spreadsheet -- Enzyme Inhibition Constant Data from BindingDB
Found 1 hit for monomerid = 50058524
Trg + Lig
Ki
nM
ΔG°
kcal/mole
IC50
nM
Kd
nM
EC50/IC50
nM
koff
s-1
kon
M-1s-1
pHTemp
°C
Mitogen-activated protein kinase kinase kinase kinase 4
(Homo sapiens (Human))
BDBM50058524
(CHEMBL3326739)
Show SMILES Brc1cc2c(Nc3ccncc3)ncnn2c1
Show InChI InChI=1S/C11H8BrN5/c12-8-5-10-11(14-7-15-17(10)6-8)16-9-1-3-13-4-2-9/h1-7H,(H,13,14,15,16)
NCI pathway
Reactome pathway
n/an/a 150n/an/an/an/an/an/a
Genentech
Curated by ChEMBL
Assay Description
Inhibition of human MAP4K4 using LGRDKYKTLRQIRQ-COOH peptide substrate by LC3K assay
Bioorg Med Chem Lett 24: 4546-52 (2014)
Article DOI: 10.1016/j.bmcl.2014.07.071
BindingDB Entry DOI: 10.7270/Q2NG4S9D