BDBM50058661 CHEMBL3326763
SMILES: CNS(=O)(=O)c1ccc(cc1)-c1cc2c(Nc3ccncc3)ncnn2c1
InChI Key: InChIKey=MZZPKOYTSZDYRW-UHFFFAOYSA-N
Data: 1 IC50
Activity Spreadsheet -- Enzyme Inhibition Constant Data from BindingDB
Found 1 hit for monomerid = 50058661
Trg + Lig
Ki
nM
ΔG°
kcal/mole
IC50
nM
Kd
nM
EC50/IC50
nM
koff
s-1
kon
M-1s-1
pHTemp
°C
Mitogen-activated protein kinase kinase kinase kinase 4
(Homo sapiens (Human))
BDBM50058661
(CHEMBL3326763)
Show SMILES CNS(=O)(=O)c1ccc(cc1)-c1cc2c(Nc3ccncc3)ncnn2c1
Show InChI InChI=1S/C18H16N6O2S/c1-19-27(25,26)16-4-2-13(3-5-16)14-10-17-18(21-12-22-24(17)11-14)23-15-6-8-20-9-7-15/h2-12,19H,1H3,(H,20,21,22,23)
NCI pathway
Reactome pathway
n/an/a 2.00E+3n/an/an/an/an/an/a
Genentech
Curated by ChEMBL
Assay Description
Inhibition of human MAP4K4 using LGRDKYKTLRQIRQ-COOH peptide substrate by LC3K assay
Bioorg Med Chem Lett 24: 4546-52 (2014)
Article DOI: 10.1016/j.bmcl.2014.07.071
BindingDB Entry DOI: 10.7270/Q2NG4S9D