null
SMILES: O=C(c1cc2c(Nc3ccncc3)ncnn2c1)c1nnn[nH]1
InChI Key: InChIKey=RURYSYBUSPUNOM-UHFFFAOYSA-N
Activity Spreadsheet -- Enzyme Inhibition Constant Data from BindingDB
Found 1 hit for monomerid = 50058679
Trg + Lig
Ki
nM
ΔG°
kcal/mole
IC50
nM
Kd
nM
EC50/IC50
nM
koff
s-1
kon
M-1s-1
pHTemp
°C
Mitogen-activated protein kinase kinase kinase kinase 4
(Homo sapiens (Human))
BDBM50058679
(CHEMBL3326750)
Show SMILES O=C(c1cc2c(Nc3ccncc3)ncnn2c1)c1nnn[nH]1
Show InChI InChI=1S/C13H9N9O/c23-11(13-18-20-21-19-13)8-5-10-12(15-7-16-22(10)6-8)17-9-1-3-14-4-2-9/h1-7H,(H,14,15,16,17)(H,18,19,20,21)
NCI pathway
Reactome pathway
n/an/a 70n/an/an/an/an/an/a
Genentech
Curated by ChEMBL
Assay Description
Inhibition of human MAP4K4 using LGRDKYKTLRQIRQ-COOH peptide substrate by LC3K assay
Bioorg Med Chem Lett 24: 4546-52 (2014)
Article DOI: 10.1016/j.bmcl.2014.07.071
BindingDB Entry DOI: 10.7270/Q2NG4S9D