BDBM50059029 (6aR,9aS)-5-ethyl-5,6a,7,8,9,9a-hexahydro-2-(phenylmethyl)cyclopent[4,5]imidazo[2,1-b]purin-4(3H)-one::2-benzyl-5-ethyl-(6aR,9aS)-1,4,5,8-tetrahydrocyclopenta[4,5]imidazo[2,1-b]purin-4-one::CHEMBL446663
SMILES: CCN1C2=N[C@@H]3CCC[C@@H]3N2c2nc(Cc3ccccc3)[nH]c2C1=O
InChI Key: InChIKey=PRCYQPWWULRKLG-KGLIPLIRSA-N
Data: 5 IC50
Activity Spreadsheet -- Enzyme Inhibition Constant Data from BindingDB
Found 5 hits for monomerid = 50059029
Trg + Lig
Ki
nM
ΔG°
kcal/mole
IC50
nM
Kd
nM
EC50/IC50
nM
koff
s-1
kon
M-1s-1
pHTemp
°C
cGMP-specific 3',5'-cyclic phosphodiesterase
(Homo sapiens (Human))
BDBM50059029
((6aR,9aS)-5-ethyl-5,6a,7,8,9,9a-hexahydro-2-(pheny...)
Show SMILES CCN1C2=N[C@@H]3CCC[C@@H]3N2c2nc(Cc3ccccc3)[nH]c2C1=O |t:3|
Show InChI InChI=1S/C19H21N5O/c1-2-23-18(25)16-17(24-14-10-6-9-13(14)20-19(23)24)22-15(21-16)11-12-7-4-3-5-8-12/h3-5,7-8,13-14H,2,6,9-11H2,1H3,(H,21,22)/t13-,14+/m1/s1
Reactome pathway
n/an/a 39n/an/an/an/an/an/a
Schering-Plough Research Institute
Curated by ChEMBL
Assay Description
Inhibitory concentration against human phosphodiesterase 5 (PDE5) enzyme
Bioorg Med Chem Lett 14: 1291-4 (2004)
Article DOI: 10.1016/j.bmcl.2003.12.027
BindingDB Entry DOI: 10.7270/Q2BG2NF0
Heart phosphodiesterase
(Bos taurus)
BDBM50059029
((6aR,9aS)-5-ethyl-5,6a,7,8,9,9a-hexahydro-2-(pheny...)
Show SMILES CCN1C2=N[C@@H]3CCC[C@@H]3N2c2nc(Cc3ccccc3)[nH]c2C1=O |t:3|
Show InChI InChI=1S/C19H21N5O/c1-2-23-18(25)16-17(24-14-10-6-9-13(14)20-19(23)24)22-15(21-16)11-12-7-4-3-5-8-12/h3-5,7-8,13-14H,2,6,9-11H2,1H3,(H,21,22)/t13-,14+/m1/s1
n/an/a 3.00E+4n/an/an/an/an/an/a
Schering-Plough Research Institute
Curated by ChEMBL
Assay Description
Inhibitory activity against phosphodiesterase 3 (PDE3) purified from bovine heart
J Med Chem 40: 2196-210 (1997)
Article DOI: 10.1021/jm9608467
BindingDB Entry DOI: 10.7270/Q2G44PFZ
cGMP-specific 3',5'-cyclic phosphodiesterase
(Homo sapiens (Human))
BDBM50059029
((6aR,9aS)-5-ethyl-5,6a,7,8,9,9a-hexahydro-2-(pheny...)
Show SMILES CCN1C2=N[C@@H]3CCC[C@@H]3N2c2nc(Cc3ccccc3)[nH]c2C1=O |t:3|
Show InChI InChI=1S/C19H21N5O/c1-2-23-18(25)16-17(24-14-10-6-9-13(14)20-19(23)24)22-15(21-16)11-12-7-4-3-5-8-12/h3-5,7-8,13-14H,2,6,9-11H2,1H3,(H,21,22)/t13-,14+/m1/s1
Reactome pathway
n/an/a 19n/an/an/an/an/an/a
Banasthali University
Curated by ChEMBL
Assay Description
Inhibition of PDE5 (unknown origin)
Bioorg Med Chem Lett 24: 3137-41 (2014)
Article DOI: 10.1016/j.bmcl.2014.05.004
BindingDB Entry DOI: 10.7270/Q2JH3NRM
Phosphodiesterase 5A
(Bos taurus)
BDBM50059029
((6aR,9aS)-5-ethyl-5,6a,7,8,9,9a-hexahydro-2-(pheny...)
Show SMILES CCN1C2=N[C@@H]3CCC[C@@H]3N2c2nc(Cc3ccccc3)[nH]c2C1=O |t:3|
Show InChI InChI=1S/C19H21N5O/c1-2-23-18(25)16-17(24-14-10-6-9-13(14)20-19(23)24)22-15(21-16)11-12-7-4-3-5-8-12/h3-5,7-8,13-14H,2,6,9-11H2,1H3,(H,21,22)/t13-,14+/m1/s1
Reactome pathway
n/an/a 19n/an/an/an/an/an/a
Schering-Plough Research Institute
Curated by ChEMBL
Assay Description
Evaluated for inhibitory activity against Phosphodiesterase 5 (PDE5) purified from bovine lung
J Med Chem 40: 2196-210 (1997)
Article DOI: 10.1021/jm9608467
BindingDB Entry DOI: 10.7270/Q2G44PFZ
cGMP-specific 3',5'-cyclic phosphodiesterase
(Homo sapiens (Human))
BDBM50059029
((6aR,9aS)-5-ethyl-5,6a,7,8,9,9a-hexahydro-2-(pheny...)
Show SMILES CCN1C2=N[C@@H]3CCC[C@@H]3N2c2nc(Cc3ccccc3)[nH]c2C1=O |t:3|
Show InChI InChI=1S/C19H21N5O/c1-2-23-18(25)16-17(24-14-10-6-9-13(14)20-19(23)24)22-15(21-16)11-12-7-4-3-5-8-12/h3-5,7-8,13-14H,2,6,9-11H2,1H3,(H,21,22)/t13-,14+/m1/s1
Reactome pathway
n/an/a 19n/an/an/an/an/an/a
Schering-Plough Research Institute
Curated by ChEMBL
Assay Description
Inhibition of human phosphodiesterase 5
Bioorg Med Chem Lett 15: 2365-9 (2005)
Article DOI: 10.1016/j.bmcl.2005.02.083
BindingDB Entry DOI: 10.7270/Q2TM79MQ