BDBM50059037 (6aR,9aS)-2-(Phenylmethyl)-5,6a,7,8,9,9a-hexahydro-5-methylcyclopent[4,5]imidazo[2,1-b]purin-4(3H)-one::2-benzyl-5-methyl-(6aR,9aS)-1,4,5,8-tetrahydrocyclopenta[4,5]imidazo[2,1-b]purin-4-one::2-benzyl-5-methyl-(6aR,9aS)-3,4,5,8-tetrahydrocyclopenta[4,5]imidazo[2,1-b]purin-4-one::CHEMBL68152
SMILES: CN1C2=N[C@@H]3CCC[C@@H]3N2c2nc(Cc3ccccc3)[nH]c2C1=O
InChI Key: InChIKey=ANKLWQVNAVGBNQ-OLZOCXBDSA-N
Data: 8 IC50
Activity Spreadsheet -- Enzyme Inhibition Constant Data from BindingDB
Found 8 hits for monomerid = 50059037
Trg + Lig
Ki
nM
ΔG°
kcal/mole
IC50
nM
Kd
nM
EC50/IC50
nM
koff
s-1
kon
M-1s-1
pHTemp
°C
Heart phosphodiesterase
(Bos taurus)
BDBM50059037
((6aR,9aS)-2-(Phenylmethyl)-5,6a,7,8,9,9a-hexahydro...)
Show SMILES CN1C2=N[C@@H]3CCC[C@@H]3N2c2nc(Cc3ccccc3)[nH]c2C1=O |t:2|
Show InChI InChI=1S/C18H19N5O/c1-22-17(24)15-16(23-13-9-5-8-12(13)19-18(22)23)21-14(20-15)10-11-6-3-2-4-7-11/h2-4,6-7,12-13H,5,8-10H2,1H3,(H,20,21)/t12-,13+/m1/s1
n/an/a 8.00E+4n/an/an/an/an/an/a
Schering-Plough Research Institute
Curated by ChEMBL
Assay Description
Inhibitory activity against phosphodiesterase 3 (PDE3) purified from bovine heart
J Med Chem 40: 2196-210 (1997)
Article DOI: 10.1021/jm9608467
BindingDB Entry DOI: 10.7270/Q2G44PFZ
Heart phosphodiesterase
(Bos taurus)
BDBM50059037
((6aR,9aS)-2-(Phenylmethyl)-5,6a,7,8,9,9a-hexahydro...)
Show SMILES CN1C2=N[C@@H]3CCC[C@@H]3N2c2nc(Cc3ccccc3)[nH]c2C1=O |t:2|
Show InChI InChI=1S/C18H19N5O/c1-22-17(24)15-16(23-13-9-5-8-12(13)19-18(22)23)21-14(20-15)10-11-6-3-2-4-7-11/h2-4,6-7,12-13H,5,8-10H2,1H3,(H,20,21)/t12-,13+/m1/s1
n/an/a 8.00E+4n/an/an/an/an/an/a
Schering-Plough Research Institute
Curated by ChEMBL
Assay Description
Inhibition of Phosphodiesterase 3 from bovine heart
J Med Chem 40: 4372-7 (1998)
Article DOI: 10.1021/jm970495b
BindingDB Entry DOI: 10.7270/Q2833R45
cGMP-specific 3',5'-cyclic phosphodiesterase
(Homo sapiens (Human))
BDBM50059037
((6aR,9aS)-2-(Phenylmethyl)-5,6a,7,8,9,9a-hexahydro...)
Show SMILES CN1C2=N[C@@H]3CCC[C@@H]3N2c2nc(Cc3ccccc3)[nH]c2C1=O |t:2|
Show InChI InChI=1S/C18H19N5O/c1-22-17(24)15-16(23-13-9-5-8-12(13)19-18(22)23)21-14(20-15)10-11-6-3-2-4-7-11/h2-4,6-7,12-13H,5,8-10H2,1H3,(H,20,21)/t12-,13+/m1/s1
Reactome pathway
n/an/a 80n/an/an/an/an/an/a
Schering-Plough Research Institute
Curated by ChEMBL
Assay Description
Inhibition of human phosphodiesterase 5
Bioorg Med Chem Lett 15: 2365-9 (2005)
Article DOI: 10.1016/j.bmcl.2005.02.083
BindingDB Entry DOI: 10.7270/Q2TM79MQ
cGMP-specific 3',5'-cyclic phosphodiesterase
(Homo sapiens (Human))
BDBM50059037
((6aR,9aS)-2-(Phenylmethyl)-5,6a,7,8,9,9a-hexahydro...)
Show SMILES CN1C2=N[C@@H]3CCC[C@@H]3N2c2nc(Cc3ccccc3)[nH]c2C1=O |t:2|
Show InChI InChI=1S/C18H19N5O/c1-22-17(24)15-16(23-13-9-5-8-12(13)19-18(22)23)21-14(20-15)10-11-6-3-2-4-7-11/h2-4,6-7,12-13H,5,8-10H2,1H3,(H,20,21)/t12-,13+/m1/s1
Reactome pathway
n/an/a 80n/an/an/an/an/an/a
Banasthali University
Curated by ChEMBL
Assay Description
Inhibition of PDE5 (unknown origin)
Bioorg Med Chem Lett 24: 3137-41 (2014)
Article DOI: 10.1016/j.bmcl.2014.05.004
BindingDB Entry DOI: 10.7270/Q2JH3NRM
Phosphodiesterase 2A
(Bos taurus)
BDBM50059037
((6aR,9aS)-2-(Phenylmethyl)-5,6a,7,8,9,9a-hexahydro...)
Show SMILES CN1C2=N[C@@H]3CCC[C@@H]3N2c2nc(Cc3ccccc3)[nH]c2C1=O |t:2|
Show InChI InChI=1S/C18H19N5O/c1-22-17(24)15-16(23-13-9-5-8-12(13)19-18(22)23)21-14(20-15)10-11-6-3-2-4-7-11/h2-4,6-7,12-13H,5,8-10H2,1H3,(H,20,21)/t12-,13+/m1/s1
n/an/a 1.50E+3n/an/an/an/an/an/a
Schering-Plough Research Institute
Curated by ChEMBL
Assay Description
Inhibition of Phosphodiesterase 2 from bovine aorta
J Med Chem 40: 4372-7 (1998)
Article DOI: 10.1021/jm970495b
BindingDB Entry DOI: 10.7270/Q2833R45
Phosphodiesterase 5A
(Bos taurus)
BDBM50059037
((6aR,9aS)-2-(Phenylmethyl)-5,6a,7,8,9,9a-hexahydro...)
Show SMILES CN1C2=N[C@@H]3CCC[C@@H]3N2c2nc(Cc3ccccc3)[nH]c2C1=O |t:2|
Show InChI InChI=1S/C18H19N5O/c1-22-17(24)15-16(23-13-9-5-8-12(13)19-18(22)23)21-14(20-15)10-11-6-3-2-4-7-11/h2-4,6-7,12-13H,5,8-10H2,1H3,(H,20,21)/t12-,13+/m1/s1
Reactome pathway
n/an/a 80n/an/an/an/an/an/a
Schering-Plough Research Institute
Curated by ChEMBL
Assay Description
Inhibition of phosphodiesterase 5 from bovine lung
J Med Chem 40: 4372-7 (1998)
Article DOI: 10.1021/jm970495b
BindingDB Entry DOI: 10.7270/Q2833R45
Phosphodiesterase 5A
(Bos taurus)
BDBM50059037
((6aR,9aS)-2-(Phenylmethyl)-5,6a,7,8,9,9a-hexahydro...)
Show SMILES CN1C2=N[C@@H]3CCC[C@@H]3N2c2nc(Cc3ccccc3)[nH]c2C1=O |t:2|
Show InChI InChI=1S/C18H19N5O/c1-22-17(24)15-16(23-13-9-5-8-12(13)19-18(22)23)21-14(20-15)10-11-6-3-2-4-7-11/h2-4,6-7,12-13H,5,8-10H2,1H3,(H,20,21)/t12-,13+/m1/s1
Reactome pathway
n/an/a 80n/an/an/an/an/an/a
Schering-Plough Research Institute
Curated by ChEMBL
Assay Description
Evaluated for inhibitory activity against Phosphodiesterase 5 (PDE5) purified from bovine lung
J Med Chem 40: 2196-210 (1997)
Article DOI: 10.1021/jm9608467
BindingDB Entry DOI: 10.7270/Q2G44PFZ
Phosphodiesterase 2A
(Bos taurus)
BDBM50059037
((6aR,9aS)-2-(Phenylmethyl)-5,6a,7,8,9,9a-hexahydro...)
Show SMILES CN1C2=N[C@@H]3CCC[C@@H]3N2c2nc(Cc3ccccc3)[nH]c2C1=O |t:2|
Show InChI InChI=1S/C18H19N5O/c1-22-17(24)15-16(23-13-9-5-8-12(13)19-18(22)23)21-14(20-15)10-11-6-3-2-4-7-11/h2-4,6-7,12-13H,5,8-10H2,1H3,(H,20,21)/t12-,13+/m1/s1
n/an/a 1.50E+3n/an/an/an/an/an/a
Schering-Plough Research Institute
Curated by ChEMBL
Assay Description
Inhibition of recombinant bovine adrenal cortex Phosphodiesterase 2 (PDE2)
J Med Chem 40: 2196-210 (1997)
Article DOI: 10.1021/jm9608467
BindingDB Entry DOI: 10.7270/Q2G44PFZ