null
SMILES: CS(=O)(=O)Nc1ccccc1Nc1nc(Nc2ccc(cc2)C#N)n2ccnc2n1
InChI Key: InChIKey=YOSLFPROBHMAID-UHFFFAOYSA-N
Activity Spreadsheet -- Enzyme Inhibition Constant Data from BindingDB
Found 1 hit for monomerid = 50059151
Trg + Lig
Ki
nM
ΔG°
kcal/mole
IC50
nM
Kd
nM
EC50/IC50
nM
koff
s-1
kon
M-1s-1
pHTemp
°C
Focal adhesion kinase 1
(Homo sapiens (Human))
BDBM50059151
(CHEMBL3393277)
Show SMILES CS(=O)(=O)Nc1ccccc1Nc1nc(Nc2ccc(cc2)C#N)n2ccnc2n1
Show InChI InChI=1S/C19H16N8O2S/c1-30(28,29)26-16-5-3-2-4-15(16)23-17-24-18-21-10-11-27(18)19(25-17)22-14-8-6-13(12-20)7-9-14/h2-11,26H,1H3,(H2,21,22,23,24,25)
NCI pathway
Reactome pathway
n/an/a 1.73E+3n/an/an/an/an/an/a
Universit£ Paris Descartes
Curated by ChEMBL
Assay Description
Inhibition of FAK (unknown origin) using ULight-poly GT as substrate after 1.6 hrs by TR-FRET assay
J Med Chem 58: 237-51 (2015)
Article DOI: 10.1021/jm500784e
BindingDB Entry DOI: 10.7270/Q2B27WZC