BDBM50059186 CHEMBL3393305
SMILES: CCCc1c(cnn1-c1cccnc1)C(=O)Nc1cc(ccc1C)S(=O)(=O)N(C)C
InChI Key: InChIKey=LHASLFVOQBHQCR-UHFFFAOYSA-N
Data: 3 IC50
Activity Spreadsheet -- Enzyme Inhibition Constant Data from BindingDB
Found 3 hits for monomerid = 50059186
Trg + Lig
Ki
nM
ΔG°
kcal/mole
IC50
nM
Kd
nM
EC50/IC50
nM
koff
s-1
kon
M-1s-1
pHTemp
°C
Mitogen-activated protein kinase 14
(Homo sapiens (Human))
BDBM50059186
(CHEMBL3393305)
Show SMILES CCCc1c(cnn1-c1cccnc1)C(=O)Nc1cc(ccc1C)S(=O)(=O)N(C)C
Show InChI InChI=1S/C21H25N5O3S/c1-5-7-20-18(14-23-26(20)16-8-6-11-22-13-16)21(27)24-19-12-17(10-9-15(19)2)30(28,29)25(3)4/h6,8-14H,5,7H2,1-4H3,(H,24,27)
NCI pathway
Reactome pathway
n/an/a 270n/an/an/an/an/an/a
AstraZeneca
Curated by ChEMBL
Assay Description
Inhibition of human recombinant 5'-c-myc, His6-tagged p38-alpha using MK2 (46 to 400) as substrate assessed as inhibition of phosphorylation after 60...
J Med Chem 58: 278-93 (2015)
Article DOI: 10.1021/jm501038s
BindingDB Entry DOI: 10.7270/Q269758W
Mitogen-activated protein kinase 14
(Homo sapiens (Human))
BDBM50059186
(CHEMBL3393305)
Show SMILES CCCc1c(cnn1-c1cccnc1)C(=O)Nc1cc(ccc1C)S(=O)(=O)N(C)C
Show InChI InChI=1S/C21H25N5O3S/c1-5-7-20-18(14-23-26(20)16-8-6-11-22-13-16)21(27)24-19-12-17(10-9-15(19)2)30(28,29)25(3)4/h6,8-14H,5,7H2,1-4H3,(H,24,27)
NCI pathway
Reactome pathway
n/an/a>1.00E+4n/an/an/an/an/an/a
AstraZeneca
Curated by ChEMBL
Assay Description
Inhibition of p38-alpha (unknown origin) by p38alpha-MBP IoC assay
J Med Chem 58: 278-93 (2015)
Article DOI: 10.1021/jm501038s
BindingDB Entry DOI: 10.7270/Q269758W
Mitogen-activated protein kinase 14
(Homo sapiens (Human))
BDBM50059186
(CHEMBL3393305)
Show SMILES CCCc1c(cnn1-c1cccnc1)C(=O)Nc1cc(ccc1C)S(=O)(=O)N(C)C
Show InChI InChI=1S/C21H25N5O3S/c1-5-7-20-18(14-23-26(20)16-8-6-11-22-13-16)21(27)24-19-12-17(10-9-15(19)2)30(28,29)25(3)4/h6,8-14H,5,7H2,1-4H3,(H,24,27)
NCI pathway
Reactome pathway
n/an/a>3.00E+4n/an/an/an/an/an/a
AstraZeneca
Curated by ChEMBL
Assay Description
Inhibition of human recombinant 5'-c-myc, His6-tagged p38-alpha using MSK1 as substrate assessed as inhibition of phosphorylation after 60 mins by EL...
J Med Chem 58: 278-93 (2015)
Article DOI: 10.1021/jm501038s
BindingDB Entry DOI: 10.7270/Q269758W