null
SMILES: CC(C)(O)c1cc(Nc2cc(ccn2)C#N)nc(c1)N1CCC(F)(F)C1
InChI Key: InChIKey=KSRDBIJRCOLMNC-UHFFFAOYSA-N
Activity Spreadsheet -- Enzyme Inhibition Constant Data from BindingDB
Found 2 hits for monomerid = 50059189
Trg + Lig
Ki
nM
ΔG°
kcal/mole
IC50
nM
Kd
nM
EC50/IC50
nM
koff
s-1
kon
M-1s-1
pHTemp
°C
Mitogen-activated protein kinase kinase kinase 12
(Homo sapiens (Human))
BDBM50059189
(CHEMBL3393332)
Show SMILES CC(C)(O)c1cc(Nc2cc(ccn2)C#N)nc(c1)N1CCC(F)(F)C1
Show InChI InChI=1S/C18H19F2N5O/c1-17(2,26)13-8-15(23-14-7-12(10-21)3-5-22-14)24-16(9-13)25-6-4-18(19,20)11-25/h3,5,7-9,26H,4,6,11H2,1-2H3,(H,22,23,24)
5n/an/an/an/an/an/an/an/a
Genentech
Curated by ChEMBL
Assay Description
Inhibition of DLK (unknown origin)
J Med Chem 58: 401-18 (2015)
Article DOI: 10.1021/jm5013984
BindingDB Entry DOI: 10.7270/Q22J6DJ5
Mitogen-activated protein kinase kinase kinase 12
(Homo sapiens (Human))
BDBM50059189
(CHEMBL3393332)
Show SMILES CC(C)(O)c1cc(Nc2cc(ccn2)C#N)nc(c1)N1CCC(F)(F)C1
Show InChI InChI=1S/C18H19F2N5O/c1-17(2,26)13-8-15(23-14-7-12(10-21)3-5-22-14)24-16(9-13)25-6-4-18(19,20)11-25/h3,5,7-9,26H,4,6,11H2,1-2H3,(H,22,23,24)
n/an/a 125n/an/an/an/an/an/a
Genentech
Curated by ChEMBL
Assay Description
Inhibition of human DLK transfected in HEK293 cells assessed as JNK phosphorylation after 5.5 hrs by Hoechst-33342 staining-based assay
J Med Chem 58: 401-18 (2015)
Article DOI: 10.1021/jm5013984
BindingDB Entry DOI: 10.7270/Q22J6DJ5