BDBM50059209 CHEMBL3393317
SMILES: Cc1nc(Nc2cc(ccn2)C#N)cc(n1)C1CCCN(C1)C(=O)c1ccccc1
InChI Key: InChIKey=BLBAMJMJBNCHSZ-UHFFFAOYSA-N
Data: 1 KI  1 IC50
Activity Spreadsheet -- Enzyme Inhibition Constant Data from BindingDB
Found 2 hits for monomerid = 50059209
Trg + Lig
Ki
nM
ΔG°
kcal/mole
IC50
nM
Kd
nM
EC50/IC50
nM
koff
s-1
kon
M-1s-1
pHTemp
°C
Mitogen-activated protein kinase kinase kinase 12
(Homo sapiens (Human))
BDBM50059209
(CHEMBL3393317)
Show SMILES Cc1nc(Nc2cc(ccn2)C#N)cc(n1)C1CCCN(C1)C(=O)c1ccccc1
Show InChI InChI=1S/C23H22N6O/c1-16-26-20(13-22(27-16)28-21-12-17(14-24)9-10-25-21)19-8-5-11-29(15-19)23(30)18-6-3-2-4-7-18/h2-4,6-7,9-10,12-13,19H,5,8,11,15H2,1H3,(H,25,26,27,28)
90n/an/an/an/an/an/an/an/a
Genentech
Curated by ChEMBL
Assay Description
Inhibition of DLK (unknown origin)
J Med Chem 58: 401-18 (2015)
Article DOI: 10.1021/jm5013984
BindingDB Entry DOI: 10.7270/Q22J6DJ5
Mitogen-activated protein kinase kinase kinase 12
(Homo sapiens (Human))
BDBM50059209
(CHEMBL3393317)
Show SMILES Cc1nc(Nc2cc(ccn2)C#N)cc(n1)C1CCCN(C1)C(=O)c1ccccc1
Show InChI InChI=1S/C23H22N6O/c1-16-26-20(13-22(27-16)28-21-12-17(14-24)9-10-25-21)19-8-5-11-29(15-19)23(30)18-6-3-2-4-7-18/h2-4,6-7,9-10,12-13,19H,5,8,11,15H2,1H3,(H,25,26,27,28)
n/an/a 1.00E+3n/an/an/an/an/an/a
Genentech
Curated by ChEMBL
Assay Description
Inhibition of human DLK transfected in HEK293 cells assessed as JNK phosphorylation after 5.5 hrs by Hoechst-33342 staining-based assay
J Med Chem 58: 401-18 (2015)
Article DOI: 10.1021/jm5013984
BindingDB Entry DOI: 10.7270/Q22J6DJ5