BDBM50059307 CHEMBL3393439::US9156845, 1
SMILES: Cn1cc(cn1)-c1c[nH]c2ncnc(N3CCOCC3)c12
InChI Key: InChIKey=VNWKCLDQBNSJJO-UHFFFAOYSA-N
Data: 6 IC50
PDB links: 1 PDB ID matches this monomer.
Activity Spreadsheet -- Enzyme Inhibition Constant Data from BindingDB
Found 6 hits for monomerid = 50059307
Trg + Lig
Ki
nM
ΔG°
kcal/mole
IC50
nM
Kd
nM
EC50/IC50
nM
koff
s-1
kon
M-1s-1
pHTemp
°C
Leucine-rich repeat serine/threonine-protein kinase 2 (LRRK2)
(Homo sapiens (Human))
BDBM50059307
(CHEMBL3393439 | US9156845, 1)
Show SMILES Cn1cc(cn1)-c1c[nH]c2ncnc(N3CCOCC3)c12
Show InChI InChI=1S/C14H16N6O/c1-19-8-10(6-18-19)11-7-15-13-12(11)14(17-9-16-13)20-2-4-21-5-3-20/h6-9H,2-5H2,1H3,(H,15,16,17)
US Patent
n/an/a 13n/an/an/an/a7.5n/a
Pfizer Inc.
US Patent
Assay Description
LRRK2 kinase activity was measured using Lantha Screen technology from Invitrogen. GST-tagged truncated LRRK2 from Invitrogen (Cat # PV4874) was incu...
US Patent US9156845 (2015)
BindingDB Entry DOI: 10.7270/Q2DB80MW
Leucine-rich repeat serine/threonine-protein kinase 2 G2019S
(Homo sapiens (Human))
BDBM50059307
(CHEMBL3393439 | US9156845, 1)
Show SMILES Cn1cc(cn1)-c1c[nH]c2ncnc(N3CCOCC3)c12
Show InChI InChI=1S/C14H16N6O/c1-19-8-10(6-18-19)11-7-15-13-12(11)14(17-9-16-13)20-2-4-21-5-3-20/h6-9H,2-5H2,1H3,(H,15,16,17)
US Patent
n/an/a 36n/an/an/an/a7.5n/a
Pfizer Inc.
US Patent
Assay Description
LRRK2 kinase activity was measured using Lantha Screen technology from Invitrogen. GST-tagged truncated LRRK2 from Invitrogen (Cat # PV4874) was incu...
US Patent US9156845 (2015)
BindingDB Entry DOI: 10.7270/Q2DB80MW
Leucine-rich repeat serine/threonine-protein kinase 2 (LRRK2)
(Homo sapiens (Human))
BDBM50059307
(CHEMBL3393439 | US9156845, 1)
Show SMILES Cn1cc(cn1)-c1c[nH]c2ncnc(N3CCOCC3)c12
Show InChI InChI=1S/C14H16N6O/c1-19-8-10(6-18-19)11-7-15-13-12(11)14(17-9-16-13)20-2-4-21-5-3-20/h6-9H,2-5H2,1H3,(H,15,16,17)
n/an/a 12n/an/an/an/an/an/a
Pfizer Inc.
Curated by ChEMBL
Assay Description
Inhibition of GST-tagged truncated human recombinant LRRK2 using fluorescein-labeled LRRKtide peptide substrate incubated for 2 hrs
J Med Chem 58: 419-32 (2015)
Article DOI: 10.1021/jm5014055
BindingDB Entry DOI: 10.7270/Q2XS5X2W
Leucine-rich repeat serine/threonine-protein kinase 2 (LRRK2)
(Homo sapiens (Human))
BDBM50059307
(CHEMBL3393439 | US9156845, 1)
Show SMILES Cn1cc(cn1)-c1c[nH]c2ncnc(N3CCOCC3)c12
Show InChI InChI=1S/C14H16N6O/c1-19-8-10(6-18-19)11-7-15-13-12(11)14(17-9-16-13)20-2-4-21-5-3-20/h6-9H,2-5H2,1H3,(H,15,16,17)
n/an/a 278n/an/an/an/an/an/a
Pfizer Inc.
Curated by ChEMBL
Assay Description
Inhibition of full length LRRK2 (unknown origin) expressed in HEK293 cells assessed as reduction in S935 phosphorylation incubated for 90 mins by ELI...
J Med Chem 58: 419-32 (2015)
Article DOI: 10.1021/jm5014055
BindingDB Entry DOI: 10.7270/Q2XS5X2W
Leucine-rich repeat serine/threonine-protein kinase 2 (LRRK2)
(Homo sapiens (Human))
BDBM50059307
(CHEMBL3393439 | US9156845, 1)
Show SMILES Cn1cc(cn1)-c1c[nH]c2ncnc(N3CCOCC3)c12
Show InChI InChI=1S/C14H16N6O/c1-19-8-10(6-18-19)11-7-15-13-12(11)14(17-9-16-13)20-2-4-21-5-3-20/h6-9H,2-5H2,1H3,(H,15,16,17)
n/an/a 36n/an/an/an/an/an/a
Pfizer Inc.
Curated by ChEMBL
Assay Description
Inhibition of GST-tagged truncated human recombinant LRRK2 G2019S mutant using fluorescein-labeled LRRKtide peptide substrate incubated for 90 mins
J Med Chem 58: 419-32 (2015)
Article DOI: 10.1021/jm5014055
BindingDB Entry DOI: 10.7270/Q2XS5X2W
Leucine-rich repeat serine/threonine-protein kinase 2 (LRRK2)
(Homo sapiens (Human))
BDBM50059307
(CHEMBL3393439 | US9156845, 1)
Show SMILES Cn1cc(cn1)-c1c[nH]c2ncnc(N3CCOCC3)c12
Show InChI InChI=1S/C14H16N6O/c1-19-8-10(6-18-19)11-7-15-13-12(11)14(17-9-16-13)20-2-4-21-5-3-20/h6-9H,2-5H2,1H3,(H,15,16,17)
n/an/a 50n/an/an/an/an/an/a
Pfizer Inc.
Curated by ChEMBL
Assay Description
Inhibition of LRRK2 in human PBMCs by ActivX KiNativ method
J Med Chem 58: 419-32 (2015)
Article DOI: 10.1021/jm5014055
BindingDB Entry DOI: 10.7270/Q2XS5X2W