BDBM50059342 (S)-2-({5-[3-(2,4-Diamino-6-oxo-1,6-dihydro-pyrimidin-5-ylsulfanyl)-propyl]-3-methyl-thiophene-2-carbonyl}-amino)-pentanedioic acid::CHEMBL84935
SMILES: Cc1cc(CCCSc2c(N)nc(N)[nH]c2=O)sc1C(=O)N[C@@H](CCC(O)=O)C(O)=O
InChI Key: InChIKey=QSMJJFQXDNSFGZ-JTQLQIEISA-N
Data: 1 KI  1 Kd
Activity Spreadsheet -- Enzyme Inhibition Constant Data from BindingDB
Found 2 hits for monomerid = 50059342
Trg + Lig
Ki
nM
ΔG°
kcal/mole
IC50
nM
Kd
nM
EC50/IC50
nM
koff
s-1
kon
M-1s-1
pHTemp
°C
Glycinamide ribonucleotide formyltransferase (GARFTase)
(Homo sapiens (Human))
BDBM50059342
((S)-2-({5-[3-(2,4-Diamino-6-oxo-1,6-dihydro-pyrimi...)
Show SMILES Cc1cc(CCCSc2c(N)nc(N)[nH]c2=O)sc1C(=O)N[C@@H](CCC(O)=O)C(O)=O
Show InChI InChI=1S/C18H23N5O6S2/c1-8-7-9(3-2-6-30-13-14(19)22-18(20)23-16(13)27)31-12(8)15(26)21-10(17(28)29)4-5-11(24)25/h7,10H,2-6H2,1H3,(H,21,26)(H,24,25)(H,28,29)(H5,19,20,22,23,27)/t10-/m0/s1
8.5n/an/an/an/an/an/an/an/a
Agouron Pharmaceuticals, Inc.
Curated by ChEMBL
Assay Description
Inhibition of recombinant human Glycinamide Ribonucleotide Transformylase (GART) using N10-formyl-5,8-dideazafolate (FDDF) as the cofactor .
J Med Chem 40: 2502-24 (1997)
Article DOI: 10.1021/jm9607459
BindingDB Entry DOI: 10.7270/Q29C6WJD
Folate receptor alpha
(Homo sapiens (Human))
BDBM50059342
((S)-2-({5-[3-(2,4-Diamino-6-oxo-1,6-dihydro-pyrimi...)
Show SMILES Cc1cc(CCCSc2c(N)nc(N)[nH]c2=O)sc1C(=O)N[C@@H](CCC(O)=O)C(O)=O
Show InChI InChI=1S/C18H23N5O6S2/c1-8-7-9(3-2-6-30-13-14(19)22-18(20)23-16(13)27)31-12(8)15(26)21-10(17(28)29)4-5-11(24)25/h7,10H,2-6H2,1H3,(H,21,26)(H,24,25)(H,28,29)(H5,19,20,22,23,27)/t10-/m0/s1
n/an/an/a 0.380n/an/an/an/an/a
Agouron Pharmaceuticals, Inc.
Curated by ChEMBL
Assay Description
compound was tested for the ability to function as transport substrates for the human folate-binding protein(mFBP)
J Med Chem 40: 2502-24 (1997)
Article DOI: 10.1021/jm9607459
BindingDB Entry DOI: 10.7270/Q29C6WJD