null
SMILES: CC(C)[C@H](NC(=O)[C@@H](NC(=O)[C@H](CC(O)=O)NC(=O)[C@@H](C)NC(=O)[C@@H](C)NC(=O)[C@@H](N)Cc1ccc(O)cc1)C(C)C)C(=O)NCC(N)=O
InChI Key: InChIKey=LCLFYHFMFBUWGU-MQTJQPALSA-N
Activity Spreadsheet -- Enzyme Inhibition Constant Data from BindingDB
Found 2 hits for monomerid = 50059372
Trg + Lig
Ki
nM
ΔG°
kcal/mole
IC50
nM
Kd
nM
EC50/IC50
nM
koff
s-1
kon
M-1s-1
pHTemp
°C
Delta-type opioid receptor
(Rattus norvegicus (rat))
BDBM50059372
((S)-3-((R)-2-{(R)-2-[(S)-2-Amino-3-(4-hydroxy-phen...)
Show SMILES CC(C)[C@H](NC(=O)[C@@H](NC(=O)[C@H](CC(O)=O)NC(=O)[C@@H](C)NC(=O)[C@@H](C)NC(=O)[C@@H](N)Cc1ccc(O)cc1)C(C)C)C(=O)NCC(N)=O
Show InChI InChI=1S/C31H48N8O10/c1-14(2)24(30(48)34-13-22(33)41)39-31(49)25(15(3)4)38-29(47)21(12-23(42)43)37-27(45)17(6)35-26(44)16(5)36-28(46)20(32)11-18-7-9-19(40)10-8-18/h7-10,14-17,20-21,24-25,40H,11-13,32H2,1-6H3,(H2,33,41)(H,34,48)(H,35,44)(H,36,46)(H,37,45)(H,38,47)(H,39,49)(H,42,43)/t16-,17-,20+,21+,24+,25+/m1/s1
Reactome pathway
5.72n/an/an/an/an/an/an/an/a
National Institute of Environmental Health Sciences
Curated by ChEMBL
Assay Description
Affinity of the compound was assessed using competitive binding assay labeled with [3H]-DPDPE (6.3 nM) for Opioid receptor delta 1
J Med Chem 40: 2579-87 (1997)
Article DOI: 10.1021/jm9700530
BindingDB Entry DOI: 10.7270/Q25M64T2
Mu-type opioid receptor
(Rattus norvegicus (rat))
BDBM50059372
((S)-3-((R)-2-{(R)-2-[(S)-2-Amino-3-(4-hydroxy-phen...)
Show SMILES CC(C)[C@H](NC(=O)[C@@H](NC(=O)[C@H](CC(O)=O)NC(=O)[C@@H](C)NC(=O)[C@@H](C)NC(=O)[C@@H](N)Cc1ccc(O)cc1)C(C)C)C(=O)NCC(N)=O
Show InChI InChI=1S/C31H48N8O10/c1-14(2)24(30(48)34-13-22(33)41)39-31(49)25(15(3)4)38-29(47)21(12-23(42)43)37-27(45)17(6)35-26(44)16(5)36-28(46)20(32)11-18-7-9-19(40)10-8-18/h7-10,14-17,20-21,24-25,40H,11-13,32H2,1-6H3,(H2,33,41)(H,34,48)(H,35,44)(H,36,46)(H,37,45)(H,38,47)(H,39,49)(H,42,43)/t16-,17-,20+,21+,24+,25+/m1/s1
Reactome pathway
1.36E+4n/an/an/an/an/an/an/an/a
National Institute of Environmental Health Sciences
Curated by ChEMBL
Assay Description
Affinity of the compound was assessed using competitive binding assay labeled with [3H]- DAGO (1.28 nM) for Opioid receptor mu 1
J Med Chem 40: 2579-87 (1997)
Article DOI: 10.1021/jm9700530
BindingDB Entry DOI: 10.7270/Q25M64T2