BDBM50059600 2-(1,8-Dihydroxy-9-oxo-9,10-dihydro-anthracen-2-yl)-N-hydroxy-acetamide::CHEMBL94589
SMILES: ONC(=O)Cc1ccc2Cc3cccc(O)c3C(=O)c2c1O
InChI Key: InChIKey=XCNJRZIVZYXXGV-UHFFFAOYSA-N
Data: 1 IC50
Activity Spreadsheet -- Enzyme Inhibition Constant Data from BindingDB
Found 1 hit for monomerid = 50059600
Trg + Lig
Ki
nM
ΔG°
kcal/mole
IC50
nM
Kd
nM
EC50/IC50
nM
koff
s-1
kon
M-1s-1
pHTemp
°C
Arachidonate 5-lipoxygenase
(Bos taurus)
BDBM50059600
(2-(1,8-Dihydroxy-9-oxo-9,10-dihydro-anthracen-2-yl...)
Show SMILES ONC(=O)Cc1ccc2Cc3cccc(O)c3C(=O)c2c1O
Show InChI InChI=1S/C16H13NO5/c18-11-3-1-2-8-6-9-4-5-10(7-12(19)17-22)15(20)14(9)16(21)13(8)11/h1-5,18,20,22H,6-7H2,(H,17,19)
Reactome pathway
n/an/a 6.00E+3n/an/an/an/an/an/a
Westfälische Wilhelms-Universität Münster
Curated by ChEMBL
Assay Description
5-LO inhibitory activity, measured by production of 5-hydroxyeicosatetraenoic acid (5-HETE) and leukotriene B4 (LTB4) in bovine polymorphonuclear leu...
J Med Chem 40: 2780-7 (1997)
Article DOI: 10.1021/jm9701785
BindingDB Entry DOI: 10.7270/Q28C9VB4