BDBM50059615 6-(1,8-Dihydroxy-9-oxo-9,10-dihydro-anthracen-2-yl)-hexanoic acid methyl ester::CHEMBL96851
SMILES: COC(=O)CCCCCc1ccc2Cc3cccc(O)c3C(=O)c2c1O
InChI Key: InChIKey=MHIFVMWEGAPIQH-UHFFFAOYSA-N
Data: 1 IC50
Activity Spreadsheet -- Enzyme Inhibition Constant Data from BindingDB
Found 1 hit for monomerid = 50059615
Trg + Lig
Ki
nM
ΔG°
kcal/mole
IC50
nM
Kd
nM
EC50/IC50
nM
koff
s-1
kon
M-1s-1
pHTemp
°C
Arachidonate 5-lipoxygenase
(Bos taurus)
BDBM50059615
(6-(1,8-Dihydroxy-9-oxo-9,10-dihydro-anthracen-2-yl...)
Show SMILES COC(=O)CCCCCc1ccc2Cc3cccc(O)c3C(=O)c2c1O
Show InChI InChI=1S/C21H22O5/c1-26-17(23)9-4-2-3-6-13-10-11-15-12-14-7-5-8-16(22)18(14)21(25)19(15)20(13)24/h5,7-8,10-11,22,24H,2-4,6,9,12H2,1H3
Reactome pathway
n/an/a>3.00E+4n/an/an/an/an/an/a
Westfälische Wilhelms-Universität Münster
Curated by ChEMBL
Assay Description
5-LO inhibitory activity, measured by production of 5-hydroxyeicosatetraenoic acid (5-HETE) and leukotriene B4 (LTB4) in bovine polymorphonuclear leu...
J Med Chem 40: 2780-7 (1997)
Article DOI: 10.1021/jm9701785
BindingDB Entry DOI: 10.7270/Q28C9VB4