BDBM50059616 3-(1,8-Dihydroxy-9-oxo-9,10-dihydro-anthracen-2-yl)-N-hydroxy-N-methyl-propionamide::CHEMBL96252
SMILES: CN(O)C(=O)CCc1ccc2Cc3cccc(O)c3C(=O)c2c1O
InChI Key: InChIKey=LVHDBGIIVFUCHR-UHFFFAOYSA-N
Data: 1 IC50
Activity Spreadsheet -- Enzyme Inhibition Constant Data from BindingDB
Found 1 hit for monomerid = 50059616
Trg + Lig
Ki
nM
ΔG°
kcal/mole
IC50
nM
Kd
nM
EC50/IC50
nM
koff
s-1
kon
M-1s-1
pHTemp
°C
Arachidonate 5-lipoxygenase
(Bos taurus)
BDBM50059616
(3-(1,8-Dihydroxy-9-oxo-9,10-dihydro-anthracen-2-yl...)
Show SMILES CN(O)C(=O)CCc1ccc2Cc3cccc(O)c3C(=O)c2c1O
Show InChI InChI=1S/C18H17NO5/c1-19(24)14(21)8-7-10-5-6-12-9-11-3-2-4-13(20)15(11)18(23)16(12)17(10)22/h2-6,20,22,24H,7-9H2,1H3
Reactome pathway
n/an/a 600n/an/an/an/an/an/a
Westfälische Wilhelms-Universität Münster
Curated by ChEMBL
Assay Description
5-LO inhibitory activity, measured by production of 5-hydroxyeicosatetraenoic acid (5-HETE) and leukotriene B4 (LTB4) in bovine polymorphonuclear leu...
J Med Chem 40: 2780-7 (1997)
Article DOI: 10.1021/jm9701785
BindingDB Entry DOI: 10.7270/Q28C9VB4