BDBM50059629 2-(1,8-Dihydroxy-9-oxo-9,10-dihydro-anthracen-2-yl)-N-hydroxy-N-methyl-3-phenyl-propionamide::CHEMBL96759
SMILES: CN(O)C(=O)C(Cc1ccccc1)c1ccc2Cc3cccc(O)c3C(=O)c2c1O
InChI Key: InChIKey=JYSWDMZEZSKFQK-UHFFFAOYSA-N
Data: 1 IC50
Activity Spreadsheet -- Enzyme Inhibition Constant Data from BindingDB
Found 1 hit for monomerid = 50059629
Trg + Lig
Ki
nM
ΔG°
kcal/mole
IC50
nM
Kd
nM
EC50/IC50
nM
koff
s-1
kon
M-1s-1
pHTemp
°C
Arachidonate 5-lipoxygenase
(Bos taurus)
BDBM50059629
(2-(1,8-Dihydroxy-9-oxo-9,10-dihydro-anthracen-2-yl...)
Show SMILES CN(O)C(=O)C(Cc1ccccc1)c1ccc2Cc3cccc(O)c3C(=O)c2c1O
Show InChI InChI=1S/C24H21NO5/c1-25(30)24(29)18(12-14-6-3-2-4-7-14)17-11-10-16-13-15-8-5-9-19(26)20(15)23(28)21(16)22(17)27/h2-11,18,26-27,30H,12-13H2,1H3
Reactome pathway
n/an/a 5.00E+3n/an/an/an/an/an/a
Westfälische Wilhelms-Universität Münster
Curated by ChEMBL
Assay Description
5-LO inhibitory activity, measured by production of 5-hydroxyeicosatetraenoic acid (5-HETE) and leukotriene B4 (LTB4) in bovine polymorphonuclear leu...
J Med Chem 40: 2780-7 (1997)
Article DOI: 10.1021/jm9701785
BindingDB Entry DOI: 10.7270/Q28C9VB4