null
SMILES: NC(=N)c1ccc2cc(oc2c1)C(=O)NCCCCCCC(O)=O
InChI Key: InChIKey=OQJAKUUGAOUJEO-UHFFFAOYSA-N
Activity Spreadsheet -- Enzyme Inhibition Constant Data from BindingDB
Found 2 hits for monomerid = 50059698
Trg + Lig
Ki
nM
ΔG°
kcal/mole
IC50
nM
Kd
nM
EC50/IC50
nM
koff
s-1
kon
M-1s-1
pHTemp
°C
Integrin alpha-IIb/beta-3
(Homo sapiens (Human))
BDBM50059698
(7-[(6-Carbamimidoyl-benzofuran-2-carbonyl)-amino]-...)
Show SMILES NC(=N)c1ccc2cc(oc2c1)C(=O)NCCCCCCC(O)=O
Show InChI InChI=1S/C17H21N3O4/c18-16(19)12-7-6-11-9-14(24-13(11)10-12)17(23)20-8-4-2-1-3-5-15(21)22/h6-7,9-10H,1-5,8H2,(H3,18,19)(H,20,23)(H,21,22)
n/an/a 7.20E+3n/an/an/an/an/an/a
Lilly Research Laboratories
Curated by ChEMBL
Assay Description
Inhibition of the platelet GPIIb-IIIa receptor measured as ability to attenuate ADP-induced (fibrinogen-mediated) platelet aggregation in human plate...
J Med Chem 40: 2843-57 (1997)
Article DOI: 10.1021/jm970020k
BindingDB Entry DOI: 10.7270/Q24M93MS
Integrin alpha-IIb/beta-3
(Homo sapiens (Human))
BDBM50059698
(7-[(6-Carbamimidoyl-benzofuran-2-carbonyl)-amino]-...)
Show SMILES NC(=N)c1ccc2cc(oc2c1)C(=O)NCCCCCCC(O)=O
Show InChI InChI=1S/C17H21N3O4/c18-16(19)12-7-6-11-9-14(24-13(11)10-12)17(23)20-8-4-2-1-3-5-15(21)22/h6-7,9-10H,1-5,8H2,(H3,18,19)(H,20,23)(H,21,22)
n/an/a 1.10E+3n/an/an/an/an/an/a
Lilly Research Laboratories
Curated by ChEMBL
Assay Description
Antagonism of fibrinogen binding to a purified human fibrinogen receptor preparation.
J Med Chem 40: 2843-57 (1997)
Article DOI: 10.1021/jm970020k
BindingDB Entry DOI: 10.7270/Q24M93MS