null
SMILES: COCC[C@@H]1CN(CCN1C[C@H](N)CS)C(=O)c1cccc2ccccc12
InChI Key: InChIKey=GKTZPBPAMFCBNI-ZWKOTPCHSA-N
Activity Spreadsheet -- Enzyme Inhibition Constant Data from BindingDB
Found 3 hits for monomerid = 50059846
Trg + Lig
Ki
nM
ΔG°
kcal/mole
IC50
nM
Kd
nM
EC50/IC50
nM
koff
s-1
kon
M-1s-1
pHTemp
°C
Protein farnesyltransferase subunit beta/geranylgeranyltransferase type-1 subunit alpha
(Bos taurus (bovine))
BDBM50059846
(CHEMBL103575 | L-745631 | [(R)-4-((S)-2-Amino-3-me...)
Show SMILES COCC[C@@H]1CN(CCN1C[C@H](N)CS)C(=O)c1cccc2ccccc12
Show InChI InChI=1S/C21H29N3O2S/c1-26-12-9-18-14-24(11-10-23(18)13-17(22)15-27)21(25)20-8-4-6-16-5-2-3-7-19(16)20/h2-8,17-18,27H,9-15,22H2,1H3/t17-,18+/m0/s1
n/an/a 5n/an/an/an/an/an/a
Warner-Lambert Company
Curated by ChEMBL
Assay Description
Activity against bovine Farnesyltransferase
J Med Chem 40: 2971-90 (1997)
Article DOI: 10.1021/jm970226l
BindingDB Entry DOI: 10.7270/Q26M37HF
Geranylgeranyl transferase type-1 subunit beta/Protein farnesyltransferase/geranylgeranyltransferase type-1 subunit alpha
(Homo sapiens (Human))
BDBM50059846
(CHEMBL103575 | L-745631 | [(R)-4-((S)-2-Amino-3-me...)
Show SMILES COCC[C@@H]1CN(CCN1C[C@H](N)CS)C(=O)c1cccc2ccccc12
Show InChI InChI=1S/C21H29N3O2S/c1-26-12-9-18-14-24(11-10-23(18)13-17(22)15-27)21(25)20-8-4-6-16-5-2-3-7-19(16)20/h2-8,17-18,27H,9-15,22H2,1H3/t17-,18+/m0/s1
n/an/a 1.00E+4n/an/an/an/an/an/a
Warner-Lambert Company
Curated by ChEMBL
Assay Description
Activity against Geranylgeranyl transferase type I
J Med Chem 40: 2971-90 (1997)
Article DOI: 10.1021/jm970226l
BindingDB Entry DOI: 10.7270/Q26M37HF
Protein farnesyltransferase subunit beta/geranylgeranyltransferase type-1 subunit alpha
(Mus musculus)
BDBM50059846
(CHEMBL103575 | L-745631 | [(R)-4-((S)-2-Amino-3-me...)
Show SMILES COCC[C@@H]1CN(CCN1C[C@H](N)CS)C(=O)c1cccc2ccccc12
Show InChI InChI=1S/C21H29N3O2S/c1-26-12-9-18-14-24(11-10-23(18)13-17(22)15-27)21(25)20-8-4-6-16-5-2-3-7-19(16)20/h2-8,17-18,27H,9-15,22H2,1H3/t17-,18+/m0/s1
n/an/a 500n/an/an/an/an/an/a
Warner-Lambert Company
Curated by ChEMBL
Assay Description
Inhibition of Ras processing
J Med Chem 40: 2971-90 (1997)
Article DOI: 10.1021/jm970226l
BindingDB Entry DOI: 10.7270/Q26M37HF