BDBM50059856 2-(2-{(S)-3-[((S)-2-Amino-3-mercapto-propionyl)-methyl-amino]-2-oxo-5-phenyl-2,3,4,5-tetrahydro-benzo[e][1,4]diazepin-1-yl}-acetylamino)-4-methylsulfanyl-butyric acid::CHEMBL103799
SMILES: CSCCC(NC(=O)CN1c2ccccc2C(N[C@@H](N(C)C(=O)[C@H](N)CS)C1=O)c1ccccc1)C(O)=O
InChI Key: InChIKey=KLVDPNOXBOQBQN-PJQBULFCSA-N
Data: 1 IC50
Activity Spreadsheet -- Enzyme Inhibition Constant Data from BindingDB
Found 1 hit for monomerid = 50059856
Trg + Lig
Ki
nM
ΔG°
kcal/mole
IC50
nM
Kd
nM
EC50/IC50
nM
koff
s-1
kon
M-1s-1
pHTemp
°C
Protein farnesyltransferase subunit beta/geranylgeranyltransferase type-1 subunit alpha
(Rattus norvegicus-Rattus norvegicus (rat))
BDBM50059856
(2-(2-{(S)-3-[((S)-2-Amino-3-mercapto-propionyl)-me...)
Show SMILES CSCCC(NC(=O)CN1c2ccccc2C(N[C@@H](N(C)C(=O)[C@H](N)CS)C1=O)c1ccccc1)C(O)=O
Show InChI InChI=1S/C26H33N5O5S2/c1-30(24(33)18(27)15-37)23-25(34)31(14-21(32)28-19(26(35)36)12-13-38-2)20-11-7-6-10-17(20)22(29-23)16-8-4-3-5-9-16/h3-11,18-19,22-23,29,37H,12-15,27H2,1-2H3,(H,28,32)(H,35,36)/t18-,19?,22?,23+/m1/s1
n/an/a 0.790n/an/an/an/an/an/a
Warner-Lambert Company
Curated by ChEMBL
Assay Description
Activity against rat Farnesyltransferase
J Med Chem 40: 2971-90 (1997)
Article DOI: 10.1021/jm970226l
BindingDB Entry DOI: 10.7270/Q26M37HF