BDBM50060033 3-[3-(4-Methyl-piperidin-1-yl)-2-(naphthalene-2-sulfonylamino)-3-oxo-propyl]-benzamidine::CHEMBL97597
SMILES: CC1CCN(CC1)C(=O)C(Cc1cccc(c1)C(N)=N)NS(=O)(=O)c1ccc2ccccc2c1
InChI Key: InChIKey=NXVHWZWNOYBQDB-UHFFFAOYSA-N
Data: 9 KI  2 IC50
Activity Spreadsheet -- Enzyme Inhibition Constant Data from BindingDB
Found 11 hits for monomerid = 50060033
Trg + Lig
Ki
nM
ΔG°
kcal/mole
IC50
nM
Kd
nM
EC50/IC50
nM
koff
s-1
kon
M-1s-1
pHTemp
°C
Thrombin
(Bos taurus (Bovine))
BDBM50060033
(3-[3-(4-Methyl-piperidin-1-yl)-2-(naphthalene-2-su...)
Show SMILES CC1CCN(CC1)C(=O)C(Cc1cccc(c1)C(N)=N)NS(=O)(=O)c1ccc2ccccc2c1
Show InChI InChI=1S/C26H30N4O3S/c1-18-11-13-30(14-12-18)26(31)24(16-19-5-4-8-22(15-19)25(27)28)29-34(32,33)23-10-9-20-6-2-3-7-21(20)17-23/h2-10,15,17-18,24,29H,11-14,16H2,1H3,(H3,27,28)
6.20n/an/an/an/an/an/an/an/a
Klinikum der Friedrich-Schiller-Universit£t Jena
Curated by ChEMBL
Assay Description
Inhibitory activity against thrombin
J Med Chem 40: 3091-9 (1997)
Article DOI: 10.1021/jm960668h
BindingDB Entry DOI: 10.7270/Q2Z60PRH
Thrombin
(Bos taurus (Bovine))
BDBM50060033
(3-[3-(4-Methyl-piperidin-1-yl)-2-(naphthalene-2-su...)
Show SMILES CC1CCN(CC1)C(=O)C(Cc1cccc(c1)C(N)=N)NS(=O)(=O)c1ccc2ccccc2c1
Show InChI InChI=1S/C26H30N4O3S/c1-18-11-13-30(14-12-18)26(31)24(16-19-5-4-8-22(15-19)25(27)28)29-34(32,33)23-10-9-20-6-2-3-7-21(20)17-23/h2-10,15,17-18,24,29H,11-14,16H2,1H3,(H3,27,28)
6.20n/an/an/an/an/an/an/an/a
Institut für Biochemie
Curated by ChEMBL
Assay Description
Inhibitory activity against bovine thrombin expressed as dissociation constant
J Med Chem 41: 5445-56 (1999)
Article DOI: 10.1021/jm981068g
BindingDB Entry DOI: 10.7270/Q2KK99ZF
Prothrombin
(Homo sapiens (Human))
BDBM50060033
(3-[3-(4-Methyl-piperidin-1-yl)-2-(naphthalene-2-su...)
Show SMILES CC1CCN(CC1)C(=O)C(Cc1cccc(c1)C(N)=N)NS(=O)(=O)c1ccc2ccccc2c1
Show InChI InChI=1S/C26H30N4O3S/c1-18-11-13-30(14-12-18)26(31)24(16-19-5-4-8-22(15-19)25(27)28)29-34(32,33)23-10-9-20-6-2-3-7-21(20)17-23/h2-10,15,17-18,24,29H,11-14,16H2,1H3,(H3,27,28)
6.20n/an/an/an/an/an/an/an/a
NV Organon
Curated by ChEMBL
Assay Description
The compound was evaluated in vitro for the thrombin inhibition.
Bioorg Med Chem Lett 9: 2837-42 (1999)
BindingDB Entry DOI: 10.7270/Q2SB468S
Trypsin
(Bos taurus (bovine))
BDBM50060033
(3-[3-(4-Methyl-piperidin-1-yl)-2-(naphthalene-2-su...)
Show SMILES CC1CCN(CC1)C(=O)C(Cc1cccc(c1)C(N)=N)NS(=O)(=O)c1ccc2ccccc2c1
Show InChI InChI=1S/C26H30N4O3S/c1-18-11-13-30(14-12-18)26(31)24(16-19-5-4-8-22(15-19)25(27)28)29-34(32,33)23-10-9-20-6-2-3-7-21(20)17-23/h2-10,15,17-18,24,29H,11-14,16H2,1H3,(H3,27,28)
140n/an/an/an/an/an/an/an/a
Institut für Biochemie
Curated by ChEMBL
Assay Description
Inhibitory activity against bovine trypsin expressed as dissociation constant
J Med Chem 41: 5445-56 (1999)
Article DOI: 10.1021/jm981068g
BindingDB Entry DOI: 10.7270/Q2KK99ZF
Trypsin II
(Bos taurus)
BDBM50060033
(3-[3-(4-Methyl-piperidin-1-yl)-2-(naphthalene-2-su...)
Show SMILES CC1CCN(CC1)C(=O)C(Cc1cccc(c1)C(N)=N)NS(=O)(=O)c1ccc2ccccc2c1
Show InChI InChI=1S/C26H30N4O3S/c1-18-11-13-30(14-12-18)26(31)24(16-19-5-4-8-22(15-19)25(27)28)29-34(32,33)23-10-9-20-6-2-3-7-21(20)17-23/h2-10,15,17-18,24,29H,11-14,16H2,1H3,(H3,27,28)
140n/an/an/an/an/an/an/an/a
Klinikum der Friedrich-Schiller-Universit£t Jena
Curated by ChEMBL
Assay Description
Inhibitory activity against trypsin
J Med Chem 40: 3091-9 (1997)
Article DOI: 10.1021/jm960668h
BindingDB Entry DOI: 10.7270/Q2Z60PRH
Plasminogen
(Homo sapiens (Human))
BDBM50060033
(3-[3-(4-Methyl-piperidin-1-yl)-2-(naphthalene-2-su...)
Show SMILES CC1CCN(CC1)C(=O)C(Cc1cccc(c1)C(N)=N)NS(=O)(=O)c1ccc2ccccc2c1
Show InChI InChI=1S/C26H30N4O3S/c1-18-11-13-30(14-12-18)26(31)24(16-19-5-4-8-22(15-19)25(27)28)29-34(32,33)23-10-9-20-6-2-3-7-21(20)17-23/h2-10,15,17-18,24,29H,11-14,16H2,1H3,(H3,27,28)
NCI pathway
Reactome pathway
5.20E+3n/an/an/an/an/an/an/an/a
Klinikum der Friedrich-Schiller-Universit£t Jena
Curated by ChEMBL
Assay Description
Inhibitory activity against plasmin
J Med Chem 40: 3091-9 (1997)
Article DOI: 10.1021/jm960668h
BindingDB Entry DOI: 10.7270/Q2Z60PRH
Urokinase-type plasminogen activator
(Homo sapiens (Human))
BDBM50060033
(3-[3-(4-Methyl-piperidin-1-yl)-2-(naphthalene-2-su...)
Show SMILES CC1CCN(CC1)C(=O)C(Cc1cccc(c1)C(N)=N)NS(=O)(=O)c1ccc2ccccc2c1
Show InChI InChI=1S/C26H30N4O3S/c1-18-11-13-30(14-12-18)26(31)24(16-19-5-4-8-22(15-19)25(27)28)29-34(32,33)23-10-9-20-6-2-3-7-21(20)17-23/h2-10,15,17-18,24,29H,11-14,16H2,1H3,(H3,27,28)
Reactome pathway
3.10E+4n/an/an/an/an/an/an/an/a
Institut für Biochemie
Curated by ChEMBL
Assay Description
Inhibitory activity against human urokinase plasminogen activator expressed as dissociation constant
J Med Chem 41: 5445-56 (1999)
Article DOI: 10.1021/jm981068g
BindingDB Entry DOI: 10.7270/Q2KK99ZF
Coagulation factor X
(Bos taurus)
BDBM50060033
(3-[3-(4-Methyl-piperidin-1-yl)-2-(naphthalene-2-su...)
Show SMILES CC1CCN(CC1)C(=O)C(Cc1cccc(c1)C(N)=N)NS(=O)(=O)c1ccc2ccccc2c1
Show InChI InChI=1S/C26H30N4O3S/c1-18-11-13-30(14-12-18)26(31)24(16-19-5-4-8-22(15-19)25(27)28)29-34(32,33)23-10-9-20-6-2-3-7-21(20)17-23/h2-10,15,17-18,24,29H,11-14,16H2,1H3,(H3,27,28)
Reactome pathway
4.10E+4n/an/an/an/an/an/an/an/a
Klinikum der Friedrich-Schiller-Universit£t Jena
Curated by ChEMBL
Assay Description
Inhibitory activity against coagulation factor X.
J Med Chem 40: 3091-9 (1997)
Article DOI: 10.1021/jm960668h
BindingDB Entry DOI: 10.7270/Q2Z60PRH
Coagulation factor X
(Bos taurus)
BDBM50060033
(3-[3-(4-Methyl-piperidin-1-yl)-2-(naphthalene-2-su...)
Show SMILES CC1CCN(CC1)C(=O)C(Cc1cccc(c1)C(N)=N)NS(=O)(=O)c1ccc2ccccc2c1
Show InChI InChI=1S/C26H30N4O3S/c1-18-11-13-30(14-12-18)26(31)24(16-19-5-4-8-22(15-19)25(27)28)29-34(32,33)23-10-9-20-6-2-3-7-21(20)17-23/h2-10,15,17-18,24,29H,11-14,16H2,1H3,(H3,27,28)
Reactome pathway
4.10E+4n/an/an/an/an/an/an/an/a
Institut für Biochemie
Curated by ChEMBL
Assay Description
Inhibitory activity against bovine coagulation factor X expressed as dissociation constant
J Med Chem 41: 5445-56 (1999)
Article DOI: 10.1021/jm981068g
BindingDB Entry DOI: 10.7270/Q2KK99ZF
Prothrombin
(Homo sapiens (Human))
BDBM50060033
(3-[3-(4-Methyl-piperidin-1-yl)-2-(naphthalene-2-su...)
Show SMILES CC1CCN(CC1)C(=O)C(Cc1cccc(c1)C(N)=N)NS(=O)(=O)c1ccc2ccccc2c1
Show InChI InChI=1S/C26H30N4O3S/c1-18-11-13-30(14-12-18)26(31)24(16-19-5-4-8-22(15-19)25(27)28)29-34(32,33)23-10-9-20-6-2-3-7-21(20)17-23/h2-10,15,17-18,24,29H,11-14,16H2,1H3,(H3,27,28)
n/an/a 640n/an/an/an/an/an/a
NV Organon
Curated by ChEMBL
Assay Description
In vitro thrombin inhibition
Bioorg Med Chem Lett 9: 2837-42 (1999)
BindingDB Entry DOI: 10.7270/Q2SB468S
Trypsin-1
(Homo sapiens (Human))
BDBM50060033
(3-[3-(4-Methyl-piperidin-1-yl)-2-(naphthalene-2-su...)
Show SMILES CC1CCN(CC1)C(=O)C(Cc1cccc(c1)C(N)=N)NS(=O)(=O)c1ccc2ccccc2c1
Show InChI InChI=1S/C26H30N4O3S/c1-18-11-13-30(14-12-18)26(31)24(16-19-5-4-8-22(15-19)25(27)28)29-34(32,33)23-10-9-20-6-2-3-7-21(20)17-23/h2-10,15,17-18,24,29H,11-14,16H2,1H3,(H3,27,28)
Reactome pathway
n/an/a 1.90E+3n/an/an/an/an/an/a
NV Organon
Curated by ChEMBL
Assay Description
In vitro trypsin inhibition
Bioorg Med Chem Lett 9: 2837-42 (1999)
BindingDB Entry DOI: 10.7270/Q2SB468S