BDBM50060419 3-(2-Pyrrolidin-1-yl-ethyl)-5-[1,2,4]triazol-4-yl-1H-indole::CHEMBL116092::L-747201
SMILES: C(Cc1c[nH]c2ccc(cc12)-n1cnnc1)N1CCCC1
InChI Key: InChIKey=WYXPLVWYFDBFBS-UHFFFAOYSA-N
Data: 10 IC50  5 EC50
Activity Spreadsheet -- Enzyme Inhibition Constant Data from BindingDB
Found 15 hits for monomerid = 50060419
Trg + Lig
Ki
nM
ΔG°
kcal/mole
IC50
nM
Kd
nM
EC50/IC50
nM
koff
s-1
kon
M-1s-1
pHTemp
°C
5-hydroxytryptamine receptor 1D
(Homo sapiens (Human))
BDBM50060419
(3-(2-Pyrrolidin-1-yl-ethyl)-5-[1,2,4]triazol-4-yl-...)
Show SMILES C(Cc1c[nH]c2ccc(cc12)-n1cnnc1)N1CCCC1
Show InChI InChI=1S/C16H19N5/c1-2-7-20(6-1)8-5-13-10-17-16-4-3-14(9-15(13)16)21-11-18-19-12-21/h3-4,9-12,17H,1-2,5-8H2
Reactome pathway
n/an/a 3.40n/an/an/an/an/an/a
Merck Sharp and Dohme Research Laboratories
Curated by ChEMBL
Assay Description
Binding affinity by displacement to human cloned 5-hydroxytryptamine 1D receptor in CHO cells by [3H]-5-HT displacement.
J Med Chem 40: 3497-500 (1997)
Article DOI: 10.1021/jm9704558
BindingDB Entry DOI: 10.7270/Q2JQ103J
5-hydroxytryptamine receptor 1D
(Homo sapiens (Human))
BDBM50060419
(3-(2-Pyrrolidin-1-yl-ethyl)-5-[1,2,4]triazol-4-yl-...)
Show SMILES C(Cc1c[nH]c2ccc(cc12)-n1cnnc1)N1CCCC1
Show InChI InChI=1S/C16H19N5/c1-2-7-20(6-1)8-5-13-10-17-16-4-3-14(9-15(13)16)21-11-18-19-12-21/h3-4,9-12,17H,1-2,5-8H2
Reactome pathway
n/an/a 3.10n/an/an/an/an/an/a
Merck Sharp & Dohme Research Laboratories
Curated by ChEMBL
Assay Description
Displacement of [3H]-5-HT binding to cloned human 5-hydroxytryptamine 1D receptor stably expressed in CHO cells
J Med Chem 42: 4981-5001 (2000)
BindingDB Entry DOI: 10.7270/Q20P0Z77
5-hydroxytryptamine receptor 1B
(Homo sapiens (Human))
BDBM50060419
(3-(2-Pyrrolidin-1-yl-ethyl)-5-[1,2,4]triazol-4-yl-...)
Show SMILES C(Cc1c[nH]c2ccc(cc12)-n1cnnc1)N1CCCC1
Show InChI InChI=1S/C16H19N5/c1-2-7-20(6-1)8-5-13-10-17-16-4-3-14(9-15(13)16)21-11-18-19-12-21/h3-4,9-12,17H,1-2,5-8H2
Reactome pathway
n/an/a 30.2n/an/an/an/an/an/a
Merck Sharp and Dohme Research Laboratories
Curated by ChEMBL
Assay Description
Binding affinity to human cloned 5-hydroxytryptamine 1B receptor in CHO cells by [3H]-5-HT binding displacement.
J Med Chem 40: 3497-500 (1997)
Article DOI: 10.1021/jm9704558
BindingDB Entry DOI: 10.7270/Q2JQ103J
5-hydroxytryptamine receptor 1D
(Homo sapiens (Human))
BDBM50060419
(3-(2-Pyrrolidin-1-yl-ethyl)-5-[1,2,4]triazol-4-yl-...)
Show SMILES C(Cc1c[nH]c2ccc(cc12)-n1cnnc1)N1CCCC1
Show InChI InChI=1S/C16H19N5/c1-2-7-20(6-1)8-5-13-10-17-16-4-3-14(9-15(13)16)21-11-18-19-12-21/h3-4,9-12,17H,1-2,5-8H2
Reactome pathway
n/an/an/an/a 2.60n/an/an/an/a
Merck Sharp and Dohme Research Laboratories
Curated by ChEMBL
Assay Description
Measurement of agonist induced [35S]-GTP-gammaS, binding in CHO cells stably transfected with 5-hydroxytryptamine 1D receptor.
J Med Chem 40: 3497-500 (1997)
Article DOI: 10.1021/jm9704558
BindingDB Entry DOI: 10.7270/Q2JQ103J
5-hydroxytryptamine receptor 1B
(Homo sapiens (Human))
BDBM50060419
(3-(2-Pyrrolidin-1-yl-ethyl)-5-[1,2,4]triazol-4-yl-...)
Show SMILES C(Cc1c[nH]c2ccc(cc12)-n1cnnc1)N1CCCC1
Show InChI InChI=1S/C16H19N5/c1-2-7-20(6-1)8-5-13-10-17-16-4-3-14(9-15(13)16)21-11-18-19-12-21/h3-4,9-12,17H,1-2,5-8H2
Reactome pathway
n/an/a 30.2n/an/an/an/an/an/a
Merck, Sharp and Dohme Research Laboratories
Curated by ChEMBL
Assay Description
Displacement of [3H]-5-HT from human 5-hydroxytryptamine 1B receptor expressed in CHO cells
J Med Chem 40: 3501-3 (1997)
Article DOI: 10.1021/jm9704560
BindingDB Entry DOI: 10.7270/Q2DZ07D8
5-hydroxytryptamine receptor 1D
(Homo sapiens (Human))
BDBM50060419
(3-(2-Pyrrolidin-1-yl-ethyl)-5-[1,2,4]triazol-4-yl-...)
Show SMILES C(Cc1c[nH]c2ccc(cc12)-n1cnnc1)N1CCCC1
Show InChI InChI=1S/C16H19N5/c1-2-7-20(6-1)8-5-13-10-17-16-4-3-14(9-15(13)16)21-11-18-19-12-21/h3-4,9-12,17H,1-2,5-8H2
Reactome pathway
n/an/an/an/a 2.60n/an/an/an/a
Merck, Sharp and Dohme Research Laboratories
Curated by ChEMBL
Assay Description
Stimulation of [35S]-GTP-gammaS, binding in CHO cells expressing 5-hydroxytryptamine 1D receptor
J Med Chem 40: 3501-3 (1997)
Article DOI: 10.1021/jm9704560
BindingDB Entry DOI: 10.7270/Q2DZ07D8
5-hydroxytryptamine receptor 1B
(Homo sapiens (Human))
BDBM50060419
(3-(2-Pyrrolidin-1-yl-ethyl)-5-[1,2,4]triazol-4-yl-...)
Show SMILES C(Cc1c[nH]c2ccc(cc12)-n1cnnc1)N1CCCC1
Show InChI InChI=1S/C16H19N5/c1-2-7-20(6-1)8-5-13-10-17-16-4-3-14(9-15(13)16)21-11-18-19-12-21/h3-4,9-12,17H,1-2,5-8H2
Reactome pathway
n/an/a 28n/an/an/an/an/an/a
Merck, Sharp and Dohme Research Laboratories
Curated by ChEMBL
Assay Description
Displacement of [3H]-5-HT binding from the cloned human 5-hydroxytryptamine 1B receptor stably expressed in CHO cells
J Med Chem 42: 677-90 (1999)
Article DOI: 10.1021/jm9805687
BindingDB Entry DOI: 10.7270/Q23777W5
5-hydroxytryptamine receptor 1D
(Homo sapiens (Human))
BDBM50060419
(3-(2-Pyrrolidin-1-yl-ethyl)-5-[1,2,4]triazol-4-yl-...)
Show SMILES C(Cc1c[nH]c2ccc(cc12)-n1cnnc1)N1CCCC1
Show InChI InChI=1S/C16H19N5/c1-2-7-20(6-1)8-5-13-10-17-16-4-3-14(9-15(13)16)21-11-18-19-12-21/h3-4,9-12,17H,1-2,5-8H2
Reactome pathway
n/an/an/an/a 2.30n/an/an/an/a
Merck, Sharp and Dohme Research Laboratories
Curated by ChEMBL
Assay Description
Stimulation of [35S]-GTP-gammaS, binding in CHO cells expressing the 5-hydroxytryptamine 1D receptor
J Med Chem 42: 691-705 (1999)
Article DOI: 10.1021/jm980569z
BindingDB Entry DOI: 10.7270/Q2ZG6RDW
5-hydroxytryptamine receptor 1D
(Homo sapiens (Human))
BDBM50060419
(3-(2-Pyrrolidin-1-yl-ethyl)-5-[1,2,4]triazol-4-yl-...)
Show SMILES C(Cc1c[nH]c2ccc(cc12)-n1cnnc1)N1CCCC1
Show InChI InChI=1S/C16H19N5/c1-2-7-20(6-1)8-5-13-10-17-16-4-3-14(9-15(13)16)21-11-18-19-12-21/h3-4,9-12,17H,1-2,5-8H2
Reactome pathway
n/an/a 3.10n/an/an/an/an/an/a
Merck, Sharp and Dohme Research Laboratories
Curated by ChEMBL
Assay Description
Displacement of [3H]-5-HT binding from human 5-hydroxytryptamine 1D receptor expressed in CHO cells
J Med Chem 42: 691-705 (1999)
Article DOI: 10.1021/jm980569z
BindingDB Entry DOI: 10.7270/Q2ZG6RDW
5-hydroxytryptamine receptor 1B
(Homo sapiens (Human))
BDBM50060419
(3-(2-Pyrrolidin-1-yl-ethyl)-5-[1,2,4]triazol-4-yl-...)
Show SMILES C(Cc1c[nH]c2ccc(cc12)-n1cnnc1)N1CCCC1
Show InChI InChI=1S/C16H19N5/c1-2-7-20(6-1)8-5-13-10-17-16-4-3-14(9-15(13)16)21-11-18-19-12-21/h3-4,9-12,17H,1-2,5-8H2
Reactome pathway
n/an/a 28n/an/an/an/an/an/a
Merck, Sharp and Dohme Research Laboratories
Curated by ChEMBL
Assay Description
Displacement of [3H]-5-HT binding from cloned human 5-hydroxytryptamine 1B receptor stably expressed in CHO cells.
J Med Chem 42: 691-705 (1999)
Article DOI: 10.1021/jm980569z
BindingDB Entry DOI: 10.7270/Q2ZG6RDW
5-hydroxytryptamine receptor 1D
(Homo sapiens (Human))
BDBM50060419
(3-(2-Pyrrolidin-1-yl-ethyl)-5-[1,2,4]triazol-4-yl-...)
Show SMILES C(Cc1c[nH]c2ccc(cc12)-n1cnnc1)N1CCCC1
Show InChI InChI=1S/C16H19N5/c1-2-7-20(6-1)8-5-13-10-17-16-4-3-14(9-15(13)16)21-11-18-19-12-21/h3-4,9-12,17H,1-2,5-8H2
Reactome pathway
n/an/an/an/a 2.30n/an/an/an/a
Merck, Sharp and Dohme Research Laboratories
Curated by ChEMBL
Assay Description
Stimulation of [35S]-GTP-gammaS, binding in CHO cells expressing the 5-hydroxytryptamine 1D receptor
J Med Chem 42: 677-90 (1999)
Article DOI: 10.1021/jm9805687
BindingDB Entry DOI: 10.7270/Q23777W5
5-hydroxytryptamine receptor 1D
(Homo sapiens (Human))
BDBM50060419
(3-(2-Pyrrolidin-1-yl-ethyl)-5-[1,2,4]triazol-4-yl-...)
Show SMILES C(Cc1c[nH]c2ccc(cc12)-n1cnnc1)N1CCCC1
Show InChI InChI=1S/C16H19N5/c1-2-7-20(6-1)8-5-13-10-17-16-4-3-14(9-15(13)16)21-11-18-19-12-21/h3-4,9-12,17H,1-2,5-8H2
Reactome pathway
n/an/a 3.10n/an/an/an/an/an/a
Merck, Sharp and Dohme Research Laboratories
Curated by ChEMBL
Assay Description
Displacement of [3H]-5-HT binding from the cloned human 5-hydroxytryptamine 1D receptor stably expressed in CHO cells
J Med Chem 42: 677-90 (1999)
Article DOI: 10.1021/jm9805687
BindingDB Entry DOI: 10.7270/Q23777W5
5-hydroxytryptamine receptor 1D
(Homo sapiens (Human))
BDBM50060419
(3-(2-Pyrrolidin-1-yl-ethyl)-5-[1,2,4]triazol-4-yl-...)
Show SMILES C(Cc1c[nH]c2ccc(cc12)-n1cnnc1)N1CCCC1
Show InChI InChI=1S/C16H19N5/c1-2-7-20(6-1)8-5-13-10-17-16-4-3-14(9-15(13)16)21-11-18-19-12-21/h3-4,9-12,17H,1-2,5-8H2
Reactome pathway
n/an/an/an/a 2.30n/an/an/an/a
Merck Sharp & Dohme Research Laboratories
Curated by ChEMBL
Assay Description
Compound was tested for measuring agonist-induced [35S]- GTPgammaS binding in CHO cells stably transfected with human 5-hydroxytryptamine 1D receptor
J Med Chem 42: 4981-5001 (2000)
BindingDB Entry DOI: 10.7270/Q20P0Z77
5-hydroxytryptamine receptor 1B
(Homo sapiens (Human))
BDBM50060419
(3-(2-Pyrrolidin-1-yl-ethyl)-5-[1,2,4]triazol-4-yl-...)
Show SMILES C(Cc1c[nH]c2ccc(cc12)-n1cnnc1)N1CCCC1
Show InChI InChI=1S/C16H19N5/c1-2-7-20(6-1)8-5-13-10-17-16-4-3-14(9-15(13)16)21-11-18-19-12-21/h3-4,9-12,17H,1-2,5-8H2
Reactome pathway
n/an/a 28n/an/an/an/an/an/a
Merck Sharp & Dohme Research Laboratories
Curated by ChEMBL
Assay Description
Displacement of [3H]-5-HT binding to cloned 5-hydroxytryptamine 1B receptor stably expressed in CHO cells
J Med Chem 42: 4981-5001 (2000)
BindingDB Entry DOI: 10.7270/Q20P0Z77
5-hydroxytryptamine receptor 1D
(Homo sapiens (Human))
BDBM50060419
(3-(2-Pyrrolidin-1-yl-ethyl)-5-[1,2,4]triazol-4-yl-...)
Show SMILES C(Cc1c[nH]c2ccc(cc12)-n1cnnc1)N1CCCC1
Show InChI InChI=1S/C16H19N5/c1-2-7-20(6-1)8-5-13-10-17-16-4-3-14(9-15(13)16)21-11-18-19-12-21/h3-4,9-12,17H,1-2,5-8H2
Reactome pathway
n/an/a 3.40n/an/an/an/an/an/a
Merck, Sharp and Dohme Research Laboratories
Curated by ChEMBL
Assay Description
Displacement of [3H]-5-HT from human 5-hydroxytryptamine 1D receptor expressed in CHO cells
J Med Chem 40: 3501-3 (1997)
Article DOI: 10.1021/jm9704560
BindingDB Entry DOI: 10.7270/Q2DZ07D8