BDBM50060485 6,7-Dihydro-5H-benzo[2,3]azepino[4,5-b]quinolin-8-ylamine::CHEMBL115697
SMILES: Nc1c2CCNc3ccccc3-c2nc2ccccc12
InChI Key: InChIKey=DWFSIOVCWIRSFW-UHFFFAOYSA-N
Data: 5 IC50
Activity Spreadsheet -- Enzyme Inhibition Constant Data from BindingDB
Found 5 hits for monomerid = 50060485
Trg + Lig
Ki
nM
ΔG°
kcal/mole
IC50
nM
Kd
nM
EC50/IC50
nM
koff
s-1
kon
M-1s-1
pHTemp
°C
Norepinephrine Monoamine transporters
(Rattus norvegicus)
BDBM50060485
(6,7-Dihydro-5H-benzo[2,3]azepino[4,5-b]quinolin-8-...)
Show SMILES Nc1c2CCNc3ccccc3-c2nc2ccccc12
Show InChI InChI=1S/C17H15N3/c18-16-11-5-1-4-8-15(11)20-17-12-6-2-3-7-14(12)19-10-9-13(16)17/h1-8,19H,9-10H2,(H2,18,20)
Reactome pathway
n/an/a 3.00E+3n/an/an/an/an/an/a
University of Strathclyde
Curated by ChEMBL
Assay Description
Inhibition of neuronal uptake of Noradrenaline in rat brain homogenate
J Med Chem 40: 3516-23 (1997)
Article DOI: 10.1021/jm970150t
BindingDB Entry DOI: 10.7270/Q25H7FC9
Cholinesterases
(Homo sapiens (Human))
BDBM50060485
(6,7-Dihydro-5H-benzo[2,3]azepino[4,5-b]quinolin-8-...)
Show SMILES Nc1c2CCNc3ccccc3-c2nc2ccccc12
Show InChI InChI=1S/C17H15N3/c18-16-11-5-1-4-8-15(11)20-17-12-6-2-3-7-14(12)19-10-9-13(16)17/h1-8,19H,9-10H2,(H2,18,20)
Reactome pathway
n/an/a 1.89E+4n/an/an/an/an/an/a
University of Strathclyde
Curated by ChEMBL
Assay Description
In vitro inhibition of Butyrylcholinesterase from human plasma.
J Med Chem 40: 3516-23 (1997)
Article DOI: 10.1021/jm970150t
BindingDB Entry DOI: 10.7270/Q25H7FC9
Acetylcholinesterase
(Homo sapiens (Human))
BDBM50060485
(6,7-Dihydro-5H-benzo[2,3]azepino[4,5-b]quinolin-8-...)
Show SMILES Nc1c2CCNc3ccccc3-c2nc2ccccc12
Show InChI InChI=1S/C17H15N3/c18-16-11-5-1-4-8-15(11)20-17-12-6-2-3-7-14(12)19-10-9-13(16)17/h1-8,19H,9-10H2,(H2,18,20)
NCI pathway
Reactome pathway
n/an/a 6.94E+4n/an/an/an/an/an/a
Sichuan University
Curated by ChEMBL
Assay Description
Inhibition of AChE
Eur J Med Chem 45: 1167-72 (2010)
Article DOI: 10.1016/j.ejmech.2009.12.038
BindingDB Entry DOI: 10.7270/Q25H7GFM
Sodium-dependent serotonin transporter
(Rattus norvegicus (rat))
BDBM50060485
(6,7-Dihydro-5H-benzo[2,3]azepino[4,5-b]quinolin-8-...)
Show SMILES Nc1c2CCNc3ccccc3-c2nc2ccccc12
Show InChI InChI=1S/C17H15N3/c18-16-11-5-1-4-8-15(11)20-17-12-6-2-3-7-14(12)19-10-9-13(16)17/h1-8,19H,9-10H2,(H2,18,20)
n/an/a 4.20E+3n/an/an/an/an/an/a
University of Strathclyde
Curated by ChEMBL
Assay Description
Inhibition of neuronal uptake of 5 - Hydroxytryptamine in rat brain homogenate
J Med Chem 40: 3516-23 (1997)
Article DOI: 10.1021/jm970150t
BindingDB Entry DOI: 10.7270/Q25H7FC9
Acetylcholinesterase
(Rattus norvegicus (rat))
BDBM50060485
(6,7-Dihydro-5H-benzo[2,3]azepino[4,5-b]quinolin-8-...)
Show SMILES Nc1c2CCNc3ccccc3-c2nc2ccccc12
Show InChI InChI=1S/C17H15N3/c18-16-11-5-1-4-8-15(11)20-17-12-6-2-3-7-14(12)19-10-9-13(16)17/h1-8,19H,9-10H2,(H2,18,20)
n/an/a 6.94E+4n/an/an/an/an/an/a
University of Strathclyde
Curated by ChEMBL
Assay Description
In vitro inhibition of acetylcholinesterase, isolated from rat brain.
J Med Chem 40: 3516-23 (1997)
Article DOI: 10.1021/jm970150t
BindingDB Entry DOI: 10.7270/Q25H7FC9