BDBM50060622 (5Z,8Z,11Z,14Z)-Icosa-5,8,11,14-tetraenoic acid ((S)-2-hydroxy-propyl)-amide::CHEMBL330974
SMILES: CCCCC\C=C/C\C=C/C\C=C/C\C=C/CCCC(=O)NC[C@H](C)O
InChI Key: InChIKey=HTNMZCWZEMNFCR-AQNSPSBUSA-N
Data: 8 KI
Activity Spreadsheet -- Enzyme Inhibition Constant Data from BindingDB
Found 8 hits for monomerid = 50060622
Trg + Lig
Ki
nM
ΔG°
kcal/mole
IC50
nM
Kd
nM
EC50/IC50
nM
koff
s-1
kon
M-1s-1
pHTemp
°C
Cannabinoid receptor 1
(Rattus norvegicus (rat))
BDBM50060622
((5Z,8Z,11Z,14Z)-Icosa-5,8,11,14-tetraenoic acid ((...)
Show SMILES CCCCC\C=C/C\C=C/C\C=C/C\C=C/CCCC(=O)NC[C@H](C)O
Show InChI InChI=1S/C23H39NO2/c1-3-4-5-6-7-8-9-10-11-12-13-14-15-16-17-18-19-20-23(26)24-21-22(2)25/h7-8,10-11,13-14,16-17,22,25H,3-6,9,12,15,18-21H2,1-2H3,(H,24,26)/b8-7-,11-10-,14-13-,17-16-/t22-/m0/s1
Reactome pathway
26n/an/an/an/an/an/an/an/a
University of Connecticut
Curated by ChEMBL
Assay Description
Tested for binding affinity to Cannabinoid receptor 1
J Med Chem 42: 896-902 (1999)
Article DOI: 10.1021/jm980461j
BindingDB Entry DOI: 10.7270/Q2XG9Q9Z
Cannabinoid receptor
(Rattus norvegicus (Rat)-Rattus norvegicus (rat))
BDBM50060622
((5Z,8Z,11Z,14Z)-Icosa-5,8,11,14-tetraenoic acid ((...)
Show SMILES CCCCC\C=C/C\C=C/C\C=C/C\C=C/CCCC(=O)NC[C@H](C)O
Show InChI InChI=1S/C23H39NO2/c1-3-4-5-6-7-8-9-10-11-12-13-14-15-16-17-18-19-20-23(26)24-21-22(2)25/h7-8,10-11,13-14,16-17,22,25H,3-6,9,12,15,18-21H2,1-2H3,(H,24,26)/b8-7-,11-10-,14-13-,17-16-/t22-/m0/s1
26n/an/an/an/an/an/an/an/a
University of Connecticut
Curated by ChEMBL
Assay Description
Binding affinity for the cannabinoid receptor in the presence of phenylmethanesulfonyl fluoride (PMSF) was determined in rat fore brain membranes
J Med Chem 37: 1889-93 (1994)
Article DOI: 10.1021/jm00038a020
BindingDB Entry DOI: 10.7270/Q2JQ13QV
Cannabinoid receptor 1
(Rattus norvegicus (rat))
BDBM50060622
((5Z,8Z,11Z,14Z)-Icosa-5,8,11,14-tetraenoic acid ((...)
Show SMILES CCCCC\C=C/C\C=C/C\C=C/C\C=C/CCCC(=O)NC[C@H](C)O
Show InChI InChI=1S/C23H39NO2/c1-3-4-5-6-7-8-9-10-11-12-13-14-15-16-17-18-19-20-23(26)24-21-22(2)25/h7-8,10-11,13-14,16-17,22,25H,3-6,9,12,15,18-21H2,1-2H3,(H,24,26)/b8-7-,11-10-,14-13-,17-16-/t22-/m0/s1
Reactome pathway
36n/an/an/an/an/an/an/an/a
University of Connecticut
Curated by ChEMBL
Assay Description
Binding affinity towards cannabinoid receptor 1 from rat forebrain membranes in the presence of phenylmethanesulfonylfluoride (PMSF) using 0.8 nM [3H...
J Med Chem 41: 5353-61 (1999)
Article DOI: 10.1021/jm970257g
BindingDB Entry DOI: 10.7270/Q2ZS2VNV
Cannabinoid receptor
(Rattus norvegicus (Rat)-Rattus norvegicus (rat))
BDBM50060622
((5Z,8Z,11Z,14Z)-Icosa-5,8,11,14-tetraenoic acid ((...)
Show SMILES CCCCC\C=C/C\C=C/C\C=C/C\C=C/CCCC(=O)NC[C@H](C)O
Show InChI InChI=1S/C23H39NO2/c1-3-4-5-6-7-8-9-10-11-12-13-14-15-16-17-18-19-20-23(26)24-21-22(2)25/h7-8,10-11,13-14,16-17,22,25H,3-6,9,12,15,18-21H2,1-2H3,(H,24,26)/b8-7-,11-10-,14-13-,17-16-/t22-/m0/s1
57n/an/an/an/an/an/an/an/a
Research Triangle Institute
Curated by ChEMBL
Assay Description
Binding affinity towards cannabinoid receptor using [3H]CP-55940 as radioligand in rat brain membrane
J Med Chem 40: 3626-34 (1997)
Article DOI: 10.1021/jm9702950
BindingDB Entry DOI: 10.7270/Q261131W
Cannabinoid receptor 1
(Rattus norvegicus (rat))
BDBM50060622
((5Z,8Z,11Z,14Z)-Icosa-5,8,11,14-tetraenoic acid ((...)
Show SMILES CCCCC\C=C/C\C=C/C\C=C/C\C=C/CCCC(=O)NC[C@H](C)O
Show InChI InChI=1S/C23H39NO2/c1-3-4-5-6-7-8-9-10-11-12-13-14-15-16-17-18-19-20-23(26)24-21-22(2)25/h7-8,10-11,13-14,16-17,22,25H,3-6,9,12,15,18-21H2,1-2H3,(H,24,26)/b8-7-,11-10-,14-13-,17-16-/t22-/m0/s1
Reactome pathway
110n/an/an/an/an/an/an/an/a
University of Connecticut
Curated by ChEMBL
Assay Description
Binding affinity towards cannabinoid receptor 1 from rat forebrain membranes in the absence of phenylmethanesulfonylfluoride (PMSF) using 0.8 nM [3H]...
J Med Chem 41: 5353-61 (1999)
Article DOI: 10.1021/jm970257g
BindingDB Entry DOI: 10.7270/Q2ZS2VNV
Cannabinoid receptor
(Rattus norvegicus (Rat)-Rattus norvegicus (rat))
BDBM50060622
((5Z,8Z,11Z,14Z)-Icosa-5,8,11,14-tetraenoic acid ((...)
Show SMILES CCCCC\C=C/C\C=C/C\C=C/C\C=C/CCCC(=O)NC[C@H](C)O
Show InChI InChI=1S/C23H39NO2/c1-3-4-5-6-7-8-9-10-11-12-13-14-15-16-17-18-19-20-23(26)24-21-22(2)25/h7-8,10-11,13-14,16-17,22,25H,3-6,9,12,15,18-21H2,1-2H3,(H,24,26)/b8-7-,11-10-,14-13-,17-16-/t22-/m0/s1
158n/an/an/an/an/an/an/an/a
University of Connecticut
Curated by ChEMBL
Assay Description
Binding affinity for the cannabinoid receptor in the absence of phenylmethanesulfonyl fluoride (PMSF) was determined in rat fore brain membranes
J Med Chem 37: 1889-93 (1994)
Article DOI: 10.1021/jm00038a020
BindingDB Entry DOI: 10.7270/Q2JQ13QV
Cannabinoid receptor 2
(MOUSE)
BDBM50060622
((5Z,8Z,11Z,14Z)-Icosa-5,8,11,14-tetraenoic acid ((...)
Show SMILES CCCCC\C=C/C\C=C/C\C=C/C\C=C/CCCC(=O)NC[C@H](C)O
Show InChI InChI=1S/C23H39NO2/c1-3-4-5-6-7-8-9-10-11-12-13-14-15-16-17-18-19-20-23(26)24-21-22(2)25/h7-8,10-11,13-14,16-17,22,25H,3-6,9,12,15,18-21H2,1-2H3,(H,24,26)/b8-7-,11-10-,14-13-,17-16-/t22-/m0/s1
Reactome pathway
771n/an/an/an/an/an/an/an/a
University of Connecticut
Curated by ChEMBL
Assay Description
Binding affinity towards Cannabinoid receptor 2 from mouse spleen membranes using 0.8 nM [3H]-CP-55,940 as radioligand
J Med Chem 41: 5353-61 (1999)
Article DOI: 10.1021/jm970257g
BindingDB Entry DOI: 10.7270/Q2ZS2VNV
Cannabinoid receptor
(Rattus norvegicus (Rat)-Rattus norvegicus (rat))
BDBM50060622
((5Z,8Z,11Z,14Z)-Icosa-5,8,11,14-tetraenoic acid ((...)
Show SMILES CCCCC\C=C/C\C=C/C\C=C/C\C=C/CCCC(=O)NC[C@H](C)O
Show InChI InChI=1S/C23H39NO2/c1-3-4-5-6-7-8-9-10-11-12-13-14-15-16-17-18-19-20-23(26)24-21-22(2)25/h7-8,10-11,13-14,16-17,22,25H,3-6,9,12,15,18-21H2,1-2H3,(H,24,26)/b8-7-,11-10-,14-13-,17-16-/t22-/m0/s1
2.89E+3n/an/an/an/an/an/an/an/a
Research Triangle Institute
Curated by ChEMBL
Assay Description
Binding affinity towards cannabinoid receptor using [3H]SR-141,716A as radioligand in rat brain membrane
J Med Chem 40: 3626-34 (1997)
Article DOI: 10.1021/jm9702950
BindingDB Entry DOI: 10.7270/Q261131W