BDBM50060647 CHEMBL3394688
SMILES: Cc1nc(sc1C(=O)NCc1cccnc1)-n1cnn(Cc2ccc(cc2)C(F)(F)F)c1=O
InChI Key: InChIKey=IQGJUDFNHPTCGC-UHFFFAOYSA-N
Data: 2 IC50
Activity Spreadsheet -- Enzyme Inhibition Constant Data from BindingDB
Found 2 hits for monomerid = 50060647
Trg + Lig
Ki
nM
ΔG°
kcal/mole
IC50
nM
Kd
nM
EC50/IC50
nM
koff
s-1
kon
M-1s-1
pHTemp
°C
Acyl-CoA desaturase 1
(Mus musculus)
BDBM50060647
(CHEMBL3394688)
Show SMILES Cc1nc(sc1C(=O)NCc1cccnc1)-n1cnn(Cc2ccc(cc2)C(F)(F)F)c1=O
Show InChI InChI=1S/C21H17F3N6O2S/c1-13-17(18(31)26-10-15-3-2-8-25-9-15)33-19(28-13)29-12-27-30(20(29)32)11-14-4-6-16(7-5-14)21(22,23)24/h2-9,12H,10-11H2,1H3,(H,26,31)
n/an/a 16n/an/an/an/an/an/a
Xenon Pharmaceuticals Inc.
Curated by ChEMBL
Assay Description
Inhibition of SCD1 in ICR mouse liver microsome using [9,10 3H]- stearoyl-Coenzyme A substrate assessed as decreased production of tritiated water af...
Bioorg Med Chem 23: 455-65 (2015)
Article DOI: 10.1016/j.bmc.2014.12.014
BindingDB Entry DOI: 10.7270/Q2GM890X
Stearoyl-CoA desaturase 1
(Homo sapiens (Human))
BDBM50060647
(CHEMBL3394688)
Show SMILES Cc1nc(sc1C(=O)NCc1cccnc1)-n1cnn(Cc2ccc(cc2)C(F)(F)F)c1=O
Show InChI InChI=1S/C21H17F3N6O2S/c1-13-17(18(31)26-10-15-3-2-8-25-9-15)33-19(28-13)29-12-27-30(20(29)32)11-14-4-6-16(7-5-14)21(22,23)24/h2-9,12H,10-11H2,1H3,(H,26,31)
n/an/a 46n/an/an/an/an/an/a
Xenon Pharmaceuticals Inc.
Curated by ChEMBL
Assay Description
Inhibition of SCD1 in human HepG2 cells using [14C]-stearate substrate assessed as decreased production of [14C]-oleic acid after 24 hrs
Bioorg Med Chem 23: 455-65 (2015)
Article DOI: 10.1016/j.bmc.2014.12.014
BindingDB Entry DOI: 10.7270/Q2GM890X