BDBM50060668 CHEMBL3394694
SMILES: Cc1nc(sc1C(=O)NCc1cccnc1)-n1cnn(CCCC(F)(F)F)c1=O
InChI Key: InChIKey=VJVXNAFSDHYZBV-UHFFFAOYSA-N
Data: 2 IC50
Activity Spreadsheet -- Enzyme Inhibition Constant Data from BindingDB
Found 2 hits for monomerid = 50060668
Trg + Lig
Ki
nM
ΔG°
kcal/mole
IC50
nM
Kd
nM
EC50/IC50
nM
koff
s-1
kon
M-1s-1
pHTemp
°C
Stearoyl-CoA desaturase 1
(Homo sapiens (Human))
BDBM50060668
(CHEMBL3394694)
Show SMILES Cc1nc(sc1C(=O)NCc1cccnc1)-n1cnn(CCCC(F)(F)F)c1=O
Show InChI InChI=1S/C17H17F3N6O2S/c1-11-13(14(27)22-9-12-4-2-6-21-8-12)29-15(24-11)25-10-23-26(16(25)28)7-3-5-17(18,19)20/h2,4,6,8,10H,3,5,7,9H2,1H3,(H,22,27)
n/an/a 398n/an/an/an/an/an/a
Xenon Pharmaceuticals Inc.
Curated by ChEMBL
Assay Description
Inhibition of SCD1 in human HepG2 cells using [14C]-stearate substrate assessed as decreased production of [14C]-oleic acid after 24 hrs
Bioorg Med Chem 23: 455-65 (2015)
Article DOI: 10.1016/j.bmc.2014.12.014
BindingDB Entry DOI: 10.7270/Q2GM890X
Acyl-CoA desaturase 1
(Mus musculus)
BDBM50060668
(CHEMBL3394694)
Show SMILES Cc1nc(sc1C(=O)NCc1cccnc1)-n1cnn(CCCC(F)(F)F)c1=O
Show InChI InChI=1S/C17H17F3N6O2S/c1-11-13(14(27)22-9-12-4-2-6-21-8-12)29-15(24-11)25-10-23-26(16(25)28)7-3-5-17(18,19)20/h2,4,6,8,10H,3,5,7,9H2,1H3,(H,22,27)
n/an/a 21n/an/an/an/an/an/a
Xenon Pharmaceuticals Inc.
Curated by ChEMBL
Assay Description
Inhibition of SCD1 in ICR mouse liver microsome using [9,10 3H]- stearoyl-Coenzyme A substrate assessed as decreased production of tritiated water af...
Bioorg Med Chem 23: 455-65 (2015)
Article DOI: 10.1016/j.bmc.2014.12.014
BindingDB Entry DOI: 10.7270/Q2GM890X