null
SMILES: COc1ccc(CNC[C@H](O)CN2CN(c3ccccc3)C3(CCN(CCc4ccccc4-c4cccs4)CC3)C2=O)cc1
InChI Key: InChIKey=VZCPVUYGEXPLKF-HKBQPEDESA-N
Activity Spreadsheet -- Enzyme Inhibition Constant Data from BindingDB
Found 2 hits for monomerid = 50060836
Trg + Lig
Ki
nM
ΔG°
kcal/mole
IC50
nM
Kd
nM
EC50/IC50
nM
koff
s-1
kon
M-1s-1
pHTemp
°C
Mu-type opioid receptor
(Homo sapiens (Human))
BDBM50060836
(CHEMBL3394743)
Show SMILES COc1ccc(CNC[C@H](O)CN2CN(c3ccccc3)C3(CCN(CCc4ccccc4-c4cccs4)CC3)C2=O)cc1 |r|
Show InChI InChI=1S/C36H42N4O3S/c1-43-32-15-13-28(14-16-32)24-37-25-31(41)26-39-27-40(30-9-3-2-4-10-30)36(35(39)42)18-21-38(22-19-36)20-17-29-8-5-6-11-33(29)34-12-7-23-44-34/h2-16,23,31,37,41H,17-22,24-27H2,1H3/t31-/m0/s1
NCI pathway
Reactome pathway
n/an/a 29n/an/an/an/an/an/a
West Chester University
Curated by ChEMBL
Assay Description
Displacement of [3H]DAMGO from human Mu opioid receptor expressed in HEK293 cells after 2 hrs by scintillation counting
Bioorg Med Chem Lett 25: 602-6 (2015)
Article DOI: 10.1016/j.bmcl.2014.12.015
BindingDB Entry DOI: 10.7270/Q23B61S0
Nociceptin receptor
(Homo sapiens (Human))
BDBM50060836
(CHEMBL3394743)
Show SMILES COc1ccc(CNC[C@H](O)CN2CN(c3ccccc3)C3(CCN(CCc4ccccc4-c4cccs4)CC3)C2=O)cc1 |r|
Show InChI InChI=1S/C36H42N4O3S/c1-43-32-15-13-28(14-16-32)24-37-25-31(41)26-39-27-40(30-9-3-2-4-10-30)36(35(39)42)18-21-38(22-19-36)20-17-29-8-5-6-11-33(29)34-12-7-23-44-34/h2-16,23,31,37,41H,17-22,24-27H2,1H3/t31-/m0/s1
Reactome pathway
n/an/a 61n/an/an/an/an/an/a
West Chester University
Curated by ChEMBL
Assay Description
Displacement of [125I]-Tyr14-nociceptin from human ORL1 expressed in HEK293 cells after 2 hrs by scintillation counting
Bioorg Med Chem Lett 25: 602-6 (2015)
Article DOI: 10.1016/j.bmcl.2014.12.015
BindingDB Entry DOI: 10.7270/Q23B61S0