null
SMILES: CCCCN(C[C@@H](O)CN1CN(c2ccccc2)C2(CCN(CCc3ccccc3-c3cccs3)CC2)C1=O)Cc1ccccc1
InChI Key: InChIKey=VFAQYCMSJSCDCB-PGUFJCEWSA-N
Activity Spreadsheet -- Enzyme Inhibition Constant Data from BindingDB
Found 2 hits for monomerid = 50060841
Trg + Lig
Ki
nM
ΔG°
kcal/mole
IC50
nM
Kd
nM
EC50/IC50
nM
koff
s-1
kon
M-1s-1
pHTemp
°C
Mu-type opioid receptor
(Homo sapiens (Human))
BDBM50060841
(CHEMBL3394746)
Show SMILES CCCCN(C[C@@H](O)CN1CN(c2ccccc2)C2(CCN(CCc3ccccc3-c3cccs3)CC2)C1=O)Cc1ccccc1 |r|
Show InChI InChI=1S/C39H48N4O2S/c1-2-3-23-41(28-32-13-6-4-7-14-32)29-35(44)30-42-31-43(34-16-8-5-9-17-34)39(38(42)45)21-25-40(26-22-39)24-20-33-15-10-11-18-36(33)37-19-12-27-46-37/h4-19,27,35,44H,2-3,20-26,28-31H2,1H3/t35-/m1/s1
NCI pathway
Reactome pathway
n/an/a 47n/an/an/an/an/an/a
West Chester University
Curated by ChEMBL
Assay Description
Displacement of [3H]DAMGO from human Mu opioid receptor expressed in HEK293 cells after 2 hrs by scintillation counting
Bioorg Med Chem Lett 25: 602-6 (2015)
Article DOI: 10.1016/j.bmcl.2014.12.015
BindingDB Entry DOI: 10.7270/Q23B61S0
Nociceptin receptor
(Homo sapiens (Human))
BDBM50060841
(CHEMBL3394746)
Show SMILES CCCCN(C[C@@H](O)CN1CN(c2ccccc2)C2(CCN(CCc3ccccc3-c3cccs3)CC2)C1=O)Cc1ccccc1 |r|
Show InChI InChI=1S/C39H48N4O2S/c1-2-3-23-41(28-32-13-6-4-7-14-32)29-35(44)30-42-31-43(34-16-8-5-9-17-34)39(38(42)45)21-25-40(26-22-39)24-20-33-15-10-11-18-36(33)37-19-12-27-46-37/h4-19,27,35,44H,2-3,20-26,28-31H2,1H3/t35-/m1/s1
Reactome pathway
n/an/a 166n/an/an/an/an/an/a
West Chester University
Curated by ChEMBL
Assay Description
Displacement of [125I]-Tyr14-nociceptin from human ORL1 expressed in HEK293 cells after 2 hrs by scintillation counting
Bioorg Med Chem Lett 25: 602-6 (2015)
Article DOI: 10.1016/j.bmcl.2014.12.015
BindingDB Entry DOI: 10.7270/Q23B61S0