BDBM50060955 (1S,3aS,3bR,10bS,12aS)-1-Hydroxy-12a-methyl-2,3,3a,3b,4,5,10b,11,12,12a-decahydro-1H-cyclohepta[a]cyclopenta[f]naphthalen-7-one::CHEMBL436000
SMILES: C[C@]12CC[C@H]3[C@@H](CCc4cc(=O)cccc34)[C@@H]1CC[C@@H]2O
InChI Key: InChIKey=KBHYJVMVBMSDCH-GFEQUFNTSA-N
Data: 1 IC50
Activity Spreadsheet -- Enzyme Inhibition Constant Data from BindingDB
Found 1 hit for monomerid = 50060955
Trg + Lig
Ki
nM
ΔG°
kcal/mole
IC50
nM
Kd
nM
EC50/IC50
nM
koff
s-1
kon
M-1s-1
pHTemp
°C
Tubulin
(Bos taurus)
BDBM50060955
((1S,3aS,3bR,10bS,12aS)-1-Hydroxy-12a-methyl-2,3,3a...)
Show SMILES C[C@]12CC[C@H]3[C@@H](CCc4cc(=O)cccc34)[C@@H]1CC[C@@H]2O
Show InChI InChI=1S/C19H24O2/c1-19-10-9-15-14-4-2-3-13(20)11-12(14)5-6-16(15)17(19)7-8-18(19)21/h2-4,11,15-18,21H,5-10H2,1H3/t15-,16-,17+,18+,19+/m1/s1
Reactome pathway
n/an/a 7.20E+3n/an/an/an/an/an/a
University of Virginia
Curated by ChEMBL
Assay Description
Inhibition of tubulin polymerization
J Med Chem 40: 3836-41 (1997)
Article DOI: 10.1021/jm970323e
BindingDB Entry DOI: 10.7270/Q2W09522