BDBM50061132 (2S,3R,4E)-2-(Hexadecanoylamino)-3-hydroxy-1-[[2,6-bis-O-(sodium oxysulfonyl)-beta-D-galactopyranosyl]oxy]-4-octadecene::CHEMBL108863
SMILES: CCCCCCCCCCCCCCCC(=O)N[C@@H](COC1OC(COS([O-])(=O)=O)C(O)C(O)C1OS([O-])(=O)=O)[C@H](O)\C=C\CCCCCCCCCCCCC
InChI Key: InChIKey=UKZCLQLLFMJONX-VNQXHBPZSA-L
Data: 1 IC50
Activity Spreadsheet -- Enzyme Inhibition Constant Data from BindingDB
Found 1 hit for monomerid = 50061132
Trg + Lig
Ki
nM
ΔG°
kcal/mole
IC50
nM
Kd
nM
EC50/IC50
nM
koff
s-1
kon
M-1s-1
pHTemp
°C
P-selectin
(Homo sapiens (Human))
BDBM50061132
((2S,3R,4E)-2-(Hexadecanoylamino)-3-hydroxy-1-[[2,6...)
Show SMILES CCCCCCCCCCCCCCCC(=O)N[C@@H](COC1OC(COS([O-])(=O)=O)C(O)C(O)C1OS([O-])(=O)=O)[C@H](O)\C=C\CCCCCCCCCCCCC
Show InChI InChI=1S/C40H77NO14S2/c1-3-5-7-9-11-13-15-17-19-21-23-25-27-29-34(42)33(41-36(43)30-28-26-24-22-20-18-16-14-12-10-8-6-4-2)31-52-40-39(55-57(49,50)51)38(45)37(44)35(54-40)32-53-56(46,47)48/h27,29,33-35,37-40,42,44-45H,3-26,28,30-32H2,1-2H3,(H,41,43)(H,46,47,48)(H,49,50,51)/p-2/b29-27+/t33-,34+,35?,37?,38?,39?,40?/m0/s1
NCI pathway
Reactome pathway
n/an/a 1.20E+3n/an/an/an/an/an/a
Bristol-Myers Squibb Pharmaceutical Research Institute
Curated by ChEMBL
Assay Description
In vitro inhibitory concentration against Selectin P in a cell-free binding assay
J Med Chem 40: 3234-47 (1997)
Article DOI: 10.1021/jm9606960
BindingDB Entry DOI: 10.7270/Q21Z454Z