BDBM50061209 2-(2,4-Bis-trifluoromethyl-phenyl)-N-[(R)-2-oxo-5-phenyl-1-(2,2,2-trifluoro-ethyl)-2,3-dihydro-1H-benzo[e][1,4]diazepin-3-yl]-acetamide::CHEMBL16900::L-768673
SMILES: FC(F)(F)CN1c2ccccc2C(=N[C@@H](NC(=O)Cc2ccc(cc2C(F)(F)F)C(F)(F)F)C1=O)c1ccccc1
InChI Key: InChIKey=VVCYJFVTVHMTBV-HSZRJFAPSA-N
Data: 3 IC50
Activity Spreadsheet -- Enzyme Inhibition Constant Data from BindingDB
Found 3 hits for monomerid = 50061209
Trg + Lig
Ki
nM
ΔG°
kcal/mole
IC50
nM
Kd
nM
EC50/IC50
nM
koff
s-1
kon
M-1s-1
pHTemp
°C
Cholecystokinin receptor
(Homo sapiens (Human))
BDBM50061209
(2-(2,4-Bis-trifluoromethyl-phenyl)-N-[(R)-2-oxo-5-...)
Show SMILES FC(F)(F)CN1c2ccccc2C(=N[C@@H](NC(=O)Cc2ccc(cc2C(F)(F)F)C(F)(F)F)C1=O)c1ccccc1 |c:13|
Show InChI InChI=1S/C27H18F9N3O2/c28-25(29,30)14-39-20-9-5-4-8-18(20)22(15-6-2-1-3-7-15)38-23(24(39)41)37-21(40)12-16-10-11-17(26(31,32)33)13-19(16)27(34,35)36/h1-11,13,23H,12,14H2,(H,37,40)/t23-/m1/s1
Reactome pathway
n/an/a>1.00E+3n/an/an/an/an/an/a
Merck Research Laboratories
Curated by ChEMBL
Assay Description
Half maximal inhibition of binding of [125I]-CCK-8 to Cholecystokinin type B receptor in guinea pig cerebral cortex.
J Med Chem 40: 3865-8 (1998)
Article DOI: 10.1021/jm970517u
BindingDB Entry DOI: 10.7270/Q2Q81C6H
Potassium voltage-gated channel subfamily H member 2
(Homo sapiens (Human))
BDBM50061209
(2-(2,4-Bis-trifluoromethyl-phenyl)-N-[(R)-2-oxo-5-...)
Show SMILES FC(F)(F)CN1c2ccccc2C(=N[C@@H](NC(=O)Cc2ccc(cc2C(F)(F)F)C(F)(F)F)C1=O)c1ccccc1 |c:13|
Show InChI InChI=1S/C27H18F9N3O2/c28-25(29,30)14-39-20-9-5-4-8-18(20)22(15-6-2-1-3-7-15)38-23(24(39)41)37-21(40)12-16-10-11-17(26(31,32)33)13-19(16)27(34,35)36/h1-11,13,23H,12,14H2,(H,37,40)/t23-/m1/s1
Reactome pathway
n/an/a 6.00E+3n/an/an/an/an/an/a
China Pharmaceutical University
Curated by ChEMBL
Assay Description
Inhibitory concentration against IKr potassium channel
Bioorg Med Chem Lett 14: 4771-7 (2004)
Article DOI: 10.1016/j.bmcl.2004.06.070
BindingDB Entry DOI: 10.7270/Q208661K
Potassium voltage-gated channel subfamily H member 2
(Homo sapiens (Human))
BDBM50061209
(2-(2,4-Bis-trifluoromethyl-phenyl)-N-[(R)-2-oxo-5-...)
Show SMILES FC(F)(F)CN1c2ccccc2C(=N[C@@H](NC(=O)Cc2ccc(cc2C(F)(F)F)C(F)(F)F)C1=O)c1ccccc1 |c:13|
Show InChI InChI=1S/C27H18F9N3O2/c28-25(29,30)14-39-20-9-5-4-8-18(20)22(15-6-2-1-3-7-15)38-23(24(39)41)37-21(40)12-16-10-11-17(26(31,32)33)13-19(16)27(34,35)36/h1-11,13,23H,12,14H2,(H,37,40)/t23-/m1/s1
Reactome pathway
n/an/a 6.00E+3n/an/an/an/an/an/a
Merck Research Laboratories
Curated by ChEMBL
Assay Description
Inhibition of Ikr current in isolated guinea pig myocytes during a 0.5 s voltage clamp step from -50 to -10 mV.
J Med Chem 40: 3865-8 (1998)
Article DOI: 10.1021/jm970517u
BindingDB Entry DOI: 10.7270/Q2Q81C6H