BDBM50061295 (S)-2-{[(4R,7S,13S)-13-[(S)-2-Amino-3-(4-hydroxy-phenyl)-propionylamino]-7-(4-fluoro-benzyl)-3,3,14,14-tetramethyl-6,9,12-trioxo-1,2-dithia-5,8,11-triaza-cyclotetradecane-4-carbonyl]-amino}-3-phenyl-propionic acid::CHEMBL129252
SMILES: CC1(C)SSC(C)(C)[C@@H](NC(=O)[C@@H](N)Cc2ccc(O)cc2)C(=O)NCC(=O)N[C@@H](Cc2ccc(F)cc2)C(=O)N[C@@H]1C(=O)N[C@@H](Cc1ccccc1)C(O)=O
InChI Key: InChIKey=YDHHDQMWNQDFHV-JONZOVCNSA-N
Data: 4 IC50
Activity Spreadsheet -- Enzyme Inhibition Constant Data from BindingDB
Found 4 hits for monomerid = 50061295
Trg + Lig
Ki
nM
ΔG°
kcal/mole
IC50
nM
Kd
nM
EC50/IC50
nM
koff
s-1
kon
M-1s-1
pHTemp
°C
Mu-type opioid receptor
(MOUSE)
BDBM50061295
((S)-2-{[(4R,7S,13S)-13-[(S)-2-Amino-3-(4-hydroxy-p...)
Show SMILES CC1(C)SSC(C)(C)[C@@H](NC(=O)[C@@H](N)Cc2ccc(O)cc2)C(=O)NCC(=O)N[C@@H](Cc2ccc(F)cc2)C(=O)N[C@@H]1C(=O)N[C@@H](Cc1ccccc1)C(O)=O
Show InChI InChI=1S/C39H47FN6O8S2/c1-38(2)31(45-33(49)27(41)18-23-12-16-26(47)17-13-23)35(51)42-21-30(48)43-28(19-24-10-14-25(40)15-11-24)34(50)46-32(39(3,4)56-55-38)36(52)44-29(37(53)54)20-22-8-6-5-7-9-22/h5-17,27-29,31-32,47H,18-21,41H2,1-4H3,(H,42,51)(H,43,48)(H,44,52)(H,45,49)(H,46,50)(H,53,54)/t27-,28-,29-,31-,32+/m0/s1
Reactome pathway
n/an/a 740n/an/an/an/an/an/a
University of Arizona
Curated by ChEMBL
Assay Description
Inhibitory potency against Opioid receptor mu 1 was determined in electrically induced strips of guinea pig ileum (GPI)
J Med Chem 40: 3957-62 (1998)
Article DOI: 10.1021/jm9704762
BindingDB Entry DOI: 10.7270/Q23R0TJ7
Mu-type opioid receptor
(Rattus norvegicus (rat))
BDBM50061295
((S)-2-{[(4R,7S,13S)-13-[(S)-2-Amino-3-(4-hydroxy-p...)
Show SMILES CC1(C)SSC(C)(C)[C@@H](NC(=O)[C@@H](N)Cc2ccc(O)cc2)C(=O)NCC(=O)N[C@@H](Cc2ccc(F)cc2)C(=O)N[C@@H]1C(=O)N[C@@H](Cc1ccccc1)C(O)=O
Show InChI InChI=1S/C39H47FN6O8S2/c1-38(2)31(45-33(49)27(41)18-23-12-16-26(47)17-13-23)35(51)42-21-30(48)43-28(19-24-10-14-25(40)15-11-24)34(50)46-32(39(3,4)56-55-38)36(52)44-29(37(53)54)20-22-8-6-5-7-9-22/h5-17,27-29,31-32,47H,18-21,41H2,1-4H3,(H,42,51)(H,43,48)(H,44,52)(H,45,49)(H,46,50)(H,53,54)/t27-,28-,29-,31-,32+/m0/s1
Reactome pathway
n/an/a 1.65E+3n/an/an/an/an/an/a
University of Arizona
Curated by ChEMBL
Assay Description
Inhibition of binding of radioligand [3H]CTOP to Opioid receptor mu 1 in rat brain
J Med Chem 40: 3957-62 (1998)
Article DOI: 10.1021/jm9704762
BindingDB Entry DOI: 10.7270/Q23R0TJ7
Delta-type opioid receptor
(Rattus norvegicus (rat))
BDBM50061295
((S)-2-{[(4R,7S,13S)-13-[(S)-2-Amino-3-(4-hydroxy-p...)
Show SMILES CC1(C)SSC(C)(C)[C@@H](NC(=O)[C@@H](N)Cc2ccc(O)cc2)C(=O)NCC(=O)N[C@@H](Cc2ccc(F)cc2)C(=O)N[C@@H]1C(=O)N[C@@H](Cc1ccccc1)C(O)=O
Show InChI InChI=1S/C39H47FN6O8S2/c1-38(2)31(45-33(49)27(41)18-23-12-16-26(47)17-13-23)35(51)42-21-30(48)43-28(19-24-10-14-25(40)15-11-24)34(50)46-32(39(3,4)56-55-38)36(52)44-29(37(53)54)20-22-8-6-5-7-9-22/h5-17,27-29,31-32,47H,18-21,41H2,1-4H3,(H,42,51)(H,43,48)(H,44,52)(H,45,49)(H,46,50)(H,53,54)/t27-,28-,29-,31-,32+/m0/s1
Reactome pathway
n/an/a 0.430n/an/an/an/an/an/a
University of Arizona
Curated by ChEMBL
Assay Description
Inhibition of binding of radioligand [3H][p-Cl-phe]-DPDPE to Opioid receptor delta 1 in rat brain
J Med Chem 40: 3957-62 (1998)
Article DOI: 10.1021/jm9704762
BindingDB Entry DOI: 10.7270/Q23R0TJ7
Delta-type opioid receptor
(MOUSE)
BDBM50061295
((S)-2-{[(4R,7S,13S)-13-[(S)-2-Amino-3-(4-hydroxy-p...)
Show SMILES CC1(C)SSC(C)(C)[C@@H](NC(=O)[C@@H](N)Cc2ccc(O)cc2)C(=O)NCC(=O)N[C@@H](Cc2ccc(F)cc2)C(=O)N[C@@H]1C(=O)N[C@@H](Cc1ccccc1)C(O)=O
Show InChI InChI=1S/C39H47FN6O8S2/c1-38(2)31(45-33(49)27(41)18-23-12-16-26(47)17-13-23)35(51)42-21-30(48)43-28(19-24-10-14-25(40)15-11-24)34(50)46-32(39(3,4)56-55-38)36(52)44-29(37(53)54)20-22-8-6-5-7-9-22/h5-17,27-29,31-32,47H,18-21,41H2,1-4H3,(H,42,51)(H,43,48)(H,44,52)(H,45,49)(H,46,50)(H,53,54)/t27-,28-,29-,31-,32+/m0/s1
Reactome pathway
n/an/a 0.0160n/an/an/an/an/an/a
University of Arizona
Curated by ChEMBL
Assay Description
Inhibitory potency against Opioid receptor delta 1 was determined in electrically induced smooth muscle contractions of mouse vas deferens (MVD)
J Med Chem 40: 3957-62 (1998)
Article DOI: 10.1021/jm9704762
BindingDB Entry DOI: 10.7270/Q23R0TJ7