BDBM50061308 (3S,4aS,8aS)-2-[(2R,3S)-2-Hydroxy-3-(3-hydroxy-2-methyl-benzoylamino)-4-phenyl-butyl]-decahydro-isoquinoline-3-carboxylic acid tert-butylamide; compound with methanesulfonic acid::CHEMBL129106::CHEMBL99607
SMILES: Cc1c(O)cccc1C(=O)N[C@@H](Cc1ccccc1)[C@H](O)CN1C[C@H]2CCCC[C@H]2C[C@H]1C(=O)NC(C)(C)C
InChI Key: InChIKey=XPOHMRPODUVLPC-GQSOHLTDSA-N
Data: 2 KI  1 IC50
Activity Spreadsheet -- Enzyme Inhibition Constant Data from BindingDB
Found 3 hits for monomerid = 50061308
Trg + Lig
Ki
nM
ΔG°
kcal/mole
IC50
nM
Kd
nM
EC50/IC50
nM
koff
s-1
kon
M-1s-1
pHTemp
°C
Human immunodeficiency virus type 1 protease
(Human immunodeficiency virus type 1)
BDBM50061308
((3S,4aS,8aS)-2-[(2R,3S)-2-Hydroxy-3-(3-hydroxy-2-m...)
Show SMILES Cc1c(O)cccc1C(=O)N[C@@H](Cc1ccccc1)[C@H](O)CN1C[C@H]2CCCC[C@H]2C[C@H]1C(=O)NC(C)(C)C
Show InChI InChI=1S/C32H45N3O4/c1-21-25(15-10-16-28(21)36)30(38)33-26(17-22-11-6-5-7-12-22)29(37)20-35-19-24-14-9-8-13-23(24)18-27(35)31(39)34-32(2,3)4/h5-7,10-12,15-16,23-24,26-27,29,36-37H,8-9,13-14,17-20H2,1-4H3,(H,33,38)(H,34,39)/t23-,24+,26-,27-,29+/m0/s1
21n/an/an/an/an/an/an/an/a
TBA
Curated by ChEMBL
Assay Description
Inhibitory activity HIV-1 protease enzyme
Bioorg Med Chem Lett 5: 727-732 (1995)
Article DOI: 10.1016/0960-894X(95)00103-Z
BindingDB Entry DOI: 10.7270/Q29S1R0T
Human immunodeficiency virus type 1 protease
(Human immunodeficiency virus type 1)
BDBM50061308
((3S,4aS,8aS)-2-[(2R,3S)-2-Hydroxy-3-(3-hydroxy-2-m...)
Show SMILES Cc1c(O)cccc1C(=O)N[C@@H](Cc1ccccc1)[C@H](O)CN1C[C@H]2CCCC[C@H]2C[C@H]1C(=O)NC(C)(C)C
Show InChI InChI=1S/C32H45N3O4/c1-21-25(15-10-16-28(21)36)30(38)33-26(17-22-11-6-5-7-12-22)29(37)20-35-19-24-14-9-8-13-23(24)18-27(35)31(39)34-32(2,3)4/h5-7,10-12,15-16,23-24,26-27,29,36-37H,8-9,13-14,17-20H2,1-4H3,(H,33,38)(H,34,39)/t23-,24+,26-,27-,29+/m0/s1
21n/an/an/an/an/an/an/an/a
Agouron Pharmaceuticals, Inc.
Curated by ChEMBL
Assay Description
Inhibitory activity against HIV-1 protease
J Med Chem 40: 3979-85 (1998)
Article DOI: 10.1021/jm9704098
BindingDB Entry DOI: 10.7270/Q2V69K71
Human immunodeficiency virus type 1 protease
(Human immunodeficiency virus type 1)
BDBM50061308
((3S,4aS,8aS)-2-[(2R,3S)-2-Hydroxy-3-(3-hydroxy-2-m...)
Show SMILES Cc1c(O)cccc1C(=O)N[C@@H](Cc1ccccc1)[C@H](O)CN1C[C@H]2CCCC[C@H]2C[C@H]1C(=O)NC(C)(C)C
Show InChI InChI=1S/C32H45N3O4/c1-21-25(15-10-16-28(21)36)30(38)33-26(17-22-11-6-5-7-12-22)29(37)20-35-19-24-14-9-8-13-23(24)18-27(35)31(39)34-32(2,3)4/h5-7,10-12,15-16,23-24,26-27,29,36-37H,8-9,13-14,17-20H2,1-4H3,(H,33,38)(H,34,39)/t23-,24+,26-,27-,29+/m0/s1
n/an/a 13n/an/an/an/an/an/a
TBA
Curated by ChEMBL
Assay Description
Inhibitory concentration required against HIV-1 protease
Bioorg Med Chem Lett 5: 2885-2890 (1995)
Article DOI: 10.1016/0960-894X(95)00506-O
BindingDB Entry DOI: 10.7270/Q2930T45