BDBM50061393 CHEMBL3393988
SMILES: NS(=O)(=O)c1cccc(c1)C(=O)Nc1nc2ccccc2n1CCN1CCCC1
InChI Key: InChIKey=WHBMGYFDSILCLH-UHFFFAOYSA-N
Data: 1 EC50
Activity Spreadsheet -- Enzyme Inhibition Constant Data from BindingDB
Found 1 hit for monomerid = 50061393
Trg + Lig
Ki
nM
ΔG°
kcal/mole
IC50
nM
Kd
nM
EC50/IC50
nM
koff
s-1
kon
M-1s-1
pHTemp
°C
Kappa-type opioid receptor
(Homo sapiens (Human))
BDBM50061393
(CHEMBL3393988)
Show SMILES NS(=O)(=O)c1cccc(c1)C(=O)Nc1nc2ccccc2n1CCN1CCCC1
Show InChI InChI=1S/C20H23N5O3S/c21-29(27,28)16-7-5-6-15(14-16)19(26)23-20-22-17-8-1-2-9-18(17)25(20)13-12-24-10-3-4-11-24/h1-2,5-9,14H,3-4,10-13H2,(H2,21,27,28)(H,22,23,26)
Reactome pathway
n/an/an/an/a 2.40E+3n/an/an/an/a
Dr. Reddy's Laboratories Ltd
Curated by ChEMBL
Assay Description
Agonist activity at human kappa opioid receptor expressed in COS7 cells after 60 mins IP1 assay
Bioorg Med Chem Lett 25: 887-92 (2015)
Article DOI: 10.1016/j.bmcl.2014.12.064
BindingDB Entry DOI: 10.7270/Q2542Q8K