BDBM50061510 (S)-N*1*-(2-Benzothiazol-2-yl-1-methyl-2-oxo-ethyl)-2-[(S)-2-(3,3-dimethyl-butyrylamino)-3,3-dimethyl-butyrylamino]-N*4*,N*4*-dimethyl-succinamide::(S)-N1-(1-(benzo[d]thiazol-2-yl)-1-oxopropan-2-yl)-2-((S)-2-(3,3-dimethylbutanamido)-3,3-dimethylbutanamido)-N4,N4-dimethylsuccinamide::CHEMBL133803
SMILES: CC(NC(=O)[C@H](CC(=O)N(C)C)NC(=O)[C@@H](NC(=O)CC(C)(C)C)C(C)(C)C)C(=O)c1nc2ccccc2s1
InChI Key: InChIKey=PEBVROFXLQAOHG-ZYTBWDKESA-N
Data: 6 IC50
Activity Spreadsheet -- Enzyme Inhibition Constant Data from BindingDB
Found 6 hits for monomerid = 50061510
Trg + Lig
Ki
nM
ΔG°
kcal/mole
IC50
nM
Kd
nM
EC50/IC50
nM
koff
s-1
kon
M-1s-1
pHTemp
°C
Human rhinovirus A protease
(Human rhinovirus B)
BDBM50061510
((S)-N*1*-(2-Benzothiazol-2-yl-1-methyl-2-oxo-ethyl...)
Show SMILES CC(NC(=O)[C@H](CC(=O)N(C)C)NC(=O)[C@@H](NC(=O)CC(C)(C)C)C(C)(C)C)C(=O)c1nc2ccccc2s1
Show InChI InChI=1S/C28H41N5O5S/c1-16(22(36)26-31-17-12-10-11-13-19(17)39-26)29-24(37)18(14-21(35)33(8)9)30-25(38)23(28(5,6)7)32-20(34)15-27(2,3)4/h10-13,16,18,23H,14-15H2,1-9H3,(H,29,37)(H,30,38)(H,32,34)/t16?,18-,23+/m0/s1
n/an/a 1.10E+3n/an/an/an/an/an/a
Boehringer Ingelheim Ltd.
Curated by ChEMBL
Assay Description
Micro molar potency of the compound to inhibit human cytomegalovirus (HCMV) protease
J Med Chem 40: 4113-35 (1998)
Article DOI: 10.1021/jm970104t
BindingDB Entry DOI: 10.7270/Q2PC31HW
Alpha-chymotrypsin
(Bos taurus (bovine))
BDBM50061510
((S)-N*1*-(2-Benzothiazol-2-yl-1-methyl-2-oxo-ethyl...)
Show SMILES CC(NC(=O)[C@H](CC(=O)N(C)C)NC(=O)[C@@H](NC(=O)CC(C)(C)C)C(C)(C)C)C(=O)c1nc2ccccc2s1
Show InChI InChI=1S/C28H41N5O5S/c1-16(22(36)26-31-17-12-10-11-13-19(17)39-26)29-24(37)18(14-21(35)33(8)9)30-25(38)23(28(5,6)7)32-20(34)15-27(2,3)4/h10-13,16,18,23H,14-15H2,1-9H3,(H,29,37)(H,30,38)(H,32,34)/t16?,18-,23+/m0/s1
Reactome pathway
n/an/a>3.00E+5n/an/an/an/an/an/a
Boehringer Ingelheim Ltd.
Curated by ChEMBL
Assay Description
Activity against serine protease bovine pancreatic Alpha-Chymotrypsinogen (BPC)
J Med Chem 40: 4113-35 (1998)
Article DOI: 10.1021/jm970104t
BindingDB Entry DOI: 10.7270/Q2PC31HW
Prolyl endopeptidase
(Sus scrofa)
BDBM50061510
((S)-N*1*-(2-Benzothiazol-2-yl-1-methyl-2-oxo-ethyl...)
Show SMILES CC(NC(=O)[C@H](CC(=O)N(C)C)NC(=O)[C@@H](NC(=O)CC(C)(C)C)C(C)(C)C)C(=O)c1nc2ccccc2s1
Show InChI InChI=1S/C28H41N5O5S/c1-16(22(36)26-31-17-12-10-11-13-19(17)39-26)29-24(37)18(14-21(35)33(8)9)30-25(38)23(28(5,6)7)32-20(34)15-27(2,3)4/h10-13,16,18,23H,14-15H2,1-9H3,(H,29,37)(H,30,38)(H,32,34)/t16?,18-,23+/m0/s1
n/an/a 9.00E+3n/an/an/an/an/an/a
Johnson& Johnson Pharmaceutical Research& Development
Curated by ChEMBL
Assay Description
Inhibition of pig kidney PEP
Bioorg Med Chem 16: 1562-95 (2008)
Article DOI: 10.1016/j.bmc.2007.11.015
BindingDB Entry DOI: 10.7270/Q21J9BNH
Leukocyte elastase
(Homo sapiens (Human))
BDBM50061510
((S)-N*1*-(2-Benzothiazol-2-yl-1-methyl-2-oxo-ethyl...)
Show SMILES CC(NC(=O)[C@H](CC(=O)N(C)C)NC(=O)[C@@H](NC(=O)CC(C)(C)C)C(C)(C)C)C(=O)c1nc2ccccc2s1
Show InChI InChI=1S/C28H41N5O5S/c1-16(22(36)26-31-17-12-10-11-13-19(17)39-26)29-24(37)18(14-21(35)33(8)9)30-25(38)23(28(5,6)7)32-20(34)15-27(2,3)4/h10-13,16,18,23H,14-15H2,1-9H3,(H,29,37)(H,30,38)(H,32,34)/t16?,18-,23+/m0/s1
Reactome pathway
n/an/a>3.00E+5n/an/an/an/an/an/a
Boehringer Ingelheim Ltd.
Curated by ChEMBL
Assay Description
Binding affinity for human leukocyte elastase(HLE) serine protease
J Med Chem 40: 4113-35 (1998)
Article DOI: 10.1021/jm970104t
BindingDB Entry DOI: 10.7270/Q2PC31HW
Pancreatic elastase
(Sus scrofa)
BDBM50061510
((S)-N*1*-(2-Benzothiazol-2-yl-1-methyl-2-oxo-ethyl...)
Show SMILES CC(NC(=O)[C@H](CC(=O)N(C)C)NC(=O)[C@@H](NC(=O)CC(C)(C)C)C(C)(C)C)C(=O)c1nc2ccccc2s1
Show InChI InChI=1S/C28H41N5O5S/c1-16(22(36)26-31-17-12-10-11-13-19(17)39-26)29-24(37)18(14-21(35)33(8)9)30-25(38)23(28(5,6)7)32-20(34)15-27(2,3)4/h10-13,16,18,23H,14-15H2,1-9H3,(H,29,37)(H,30,38)(H,32,34)/t16?,18-,23+/m0/s1
n/an/a 9.00E+3n/an/an/an/an/an/a
Boehringer Ingelheim Ltd.
Curated by ChEMBL
Assay Description
Activity against serine protease porcine pancreatic elastase (PPE)
J Med Chem 40: 4113-35 (1998)
Article DOI: 10.1021/jm970104t
BindingDB Entry DOI: 10.7270/Q2PC31HW
Cathepsin B
(Homo sapiens (Human))
BDBM50061510
((S)-N*1*-(2-Benzothiazol-2-yl-1-methyl-2-oxo-ethyl...)
Show SMILES CC(NC(=O)[C@H](CC(=O)N(C)C)NC(=O)[C@@H](NC(=O)CC(C)(C)C)C(C)(C)C)C(=O)c1nc2ccccc2s1
Show InChI InChI=1S/C28H41N5O5S/c1-16(22(36)26-31-17-12-10-11-13-19(17)39-26)29-24(37)18(14-21(35)33(8)9)30-25(38)23(28(5,6)7)32-20(34)15-27(2,3)4/h10-13,16,18,23H,14-15H2,1-9H3,(H,29,37)(H,30,38)(H,32,34)/t16?,18-,23+/m0/s1
Reactome pathway
n/an/a 1.90E+4n/an/an/an/an/an/a
Boehringer Ingelheim Ltd.
Curated by ChEMBL
Assay Description
Activity against serine protease human liver Cathepsin B (cat-B )
J Med Chem 40: 4113-35 (1998)
Article DOI: 10.1021/jm970104t
BindingDB Entry DOI: 10.7270/Q2PC31HW