BDBM50061561 CHEMBL132966::Methyl-((E)-4-pyridin-3-yl-but-3-enyl)-amine::N-methyl-4-(pyridin-3-yl)but-3-en-1-amine
SMILES: CNCC\C=C\c1cccnc1
InChI Key: InChIKey=JUOSGGQXEBBCJB-GORDUTHDSA-N
Data: 5 KI  4 EC50
Activity Spreadsheet -- Enzyme Inhibition Constant Data from BindingDB
Found 9 hits for monomerid = 50061561
Trg + Lig
Ki
nM
ΔG°
kcal/mole
IC50
nM
Kd
nM
EC50/IC50
nM
koff
s-1
kon
M-1s-1
pHTemp
°C
Neuronal acetylcholine receptor Alpha-4/Beta-2
(Homo sapiens (Human))
BDBM50061561
(CHEMBL132966 | Methyl-((E)-4-pyridin-3-yl-but-3-en...)
Show SMILES CNCC\C=C\c1cccnc1
Show InChI InChI=1S/C10H14N2/c1-11-7-3-2-5-10-6-4-8-12-9-10/h2,4-6,8-9,11H,3,7H2,1H3/b5-2+
NCI pathway
Reactome pathway
25n/an/an/an/an/an/an/an/a
Virginia Commonwealth University
Curated by ChEMBL
Assay Description
Binding affinity towards nicotinic acetylcholine receptor alpha4-beta2 from rat brain homogenates
Bioorg Med Chem Lett 14: 523-6 (2003)
BindingDB Entry DOI: 10.7270/Q20P117F
Neuronal acetylcholine receptor protein alpha-4/beta-2 subunit
(Rattus norvegicus (Rat))
BDBM50061561
(CHEMBL132966 | Methyl-((E)-4-pyridin-3-yl-but-3-en...)
Show SMILES CNCC\C=C\c1cccnc1
Show InChI InChI=1S/C10H14N2/c1-11-7-3-2-5-10-6-4-8-12-9-10/h2,4-6,8-9,11H,3,7H2,1H3/b5-2+
26n/an/an/an/an/an/an/an/a
Abbott Laboratories
Curated by ChEMBL
Assay Description
Compound was evaluated for functional potencies and efficacies at rat Nicotinic acetylcholine receptor alpha4-beta2
J Med Chem 40: 4169-94 (1998)
Article DOI: 10.1021/jm970377o
BindingDB Entry DOI: 10.7270/Q2QF8TH9
Neuronal acetylcholine receptor Alpha-4/Beta-2
(Homo sapiens (Human))
BDBM50061561
(CHEMBL132966 | Methyl-((E)-4-pyridin-3-yl-but-3-en...)
Show SMILES CNCC\C=C\c1cccnc1
Show InChI InChI=1S/C10H14N2/c1-11-7-3-2-5-10-6-4-8-12-9-10/h2,4-6,8-9,11H,3,7H2,1H3/b5-2+
NCI pathway
Reactome pathway
26n/an/an/an/an/an/an/an/a
Targacept, Inc.
Curated by ChEMBL
Assay Description
Displacement of [3H]nicotine from human alpha4beta2 nAChR expressed in human SH-EP1 cells
J Med Chem 55: 9929-45 (2012)
Article DOI: 10.1021/jm3011299
BindingDB Entry DOI: 10.7270/Q2474C0B
Neuronal acetylcholine receptor protein alpha-7 subunit
(Homo sapiens (Human))
BDBM50061561
(CHEMBL132966 | Methyl-((E)-4-pyridin-3-yl-but-3-en...)
Show SMILES CNCC\C=C\c1cccnc1
Show InChI InChI=1S/C10H14N2/c1-11-7-3-2-5-10-6-4-8-12-9-10/h2,4-6,8-9,11H,3,7H2,1H3/b5-2+
8.00E+3n/an/an/an/an/an/an/an/a
Targacept, Inc.
Curated by ChEMBL
Assay Description
Displacement of [3H]epibatidine from human alpha7 nAChR expressed in human HEK/RIC3 cells
J Med Chem 55: 9929-45 (2012)
Article DOI: 10.1021/jm3011299
BindingDB Entry DOI: 10.7270/Q2474C0B
Neuronal acetylcholine receptor
(Rattus norvegicus (Rat))
BDBM50061561
(CHEMBL132966 | Methyl-((E)-4-pyridin-3-yl-but-3-en...)
Show SMILES CNCC\C=C\c1cccnc1
Show InChI InChI=1S/C10H14N2/c1-11-7-3-2-5-10-6-4-8-12-9-10/h2,4-6,8-9,11H,3,7H2,1H3/b5-2+
Reactome pathway
3.60E+4n/an/an/an/an/an/an/an/a
Abbott Laboratories
Curated by ChEMBL
Assay Description
Affinity for Nicotinic acetylcholine receptor alpha7
J Med Chem 40: 4169-94 (1998)
Article DOI: 10.1021/jm970377o
BindingDB Entry DOI: 10.7270/Q2QF8TH9
Neuronal acetylcholine receptor Alpha-4/Beta-2
(Homo sapiens (Human))
BDBM50061561
(CHEMBL132966 | Methyl-((E)-4-pyridin-3-yl-but-3-en...)
Show SMILES CNCC\C=C\c1cccnc1
Show InChI InChI=1S/C10H14N2/c1-11-7-3-2-5-10-6-4-8-12-9-10/h2,4-6,8-9,11H,3,7H2,1H3/b5-2+
NCI pathway
Reactome pathway
n/an/an/an/a 4.30E+3n/an/an/an/a
Abbott Laboratories
Curated by ChEMBL
Assay Description
Compound was evaluated for functional potencies and efficacies at human Nicotinic acetylcholine receptor subtype TE671 (muscle)
J Med Chem 40: 4169-94 (1998)
Article DOI: 10.1021/jm970377o
BindingDB Entry DOI: 10.7270/Q2QF8TH9
Neuronal acetylcholine receptor; alpha3/beta4
(Homo sapiens (Human))
BDBM50061561
(CHEMBL132966 | Methyl-((E)-4-pyridin-3-yl-but-3-en...)
Show SMILES CNCC\C=C\c1cccnc1
Show InChI InChI=1S/C10H14N2/c1-11-7-3-2-5-10-6-4-8-12-9-10/h2,4-6,8-9,11H,3,7H2,1H3/b5-2+
n/an/an/an/a 4.60E+4n/an/an/an/a
Abbott Laboratories
Curated by ChEMBL
Assay Description
Binding affinity against Nicotinic Acetylcholine Receptor was determined by measuring the displacement of [3H]-cytisine from a preparation of whole r...
J Med Chem 40: 4169-94 (1998)
Article DOI: 10.1021/jm970377o
BindingDB Entry DOI: 10.7270/Q2QF8TH9
Neuronal acetylcholine receptor protein alpha-4/beta-2 subunit
(Rattus norvegicus (Rat))
BDBM50061561
(CHEMBL132966 | Methyl-((E)-4-pyridin-3-yl-but-3-en...)
Show SMILES CNCC\C=C\c1cccnc1
Show InChI InChI=1S/C10H14N2/c1-11-7-3-2-5-10-6-4-8-12-9-10/h2,4-6,8-9,11H,3,7H2,1H3/b5-2+
n/an/an/an/a 730n/an/an/an/a
Abbott Laboratories
Curated by ChEMBL
Assay Description
Functional potency for Nicotinic acetylcholine receptor alpha4-beta2 (rat brain)
J Med Chem 40: 4169-94 (1998)
Article DOI: 10.1021/jm970377o
BindingDB Entry DOI: 10.7270/Q2QF8TH9
Acetylcholine receptor
(Torpedo californica)
BDBM50061561
(CHEMBL132966 | Methyl-((E)-4-pyridin-3-yl-but-3-en...)
Show SMILES CNCC\C=C\c1cccnc1
Show InChI InChI=1S/C10H14N2/c1-11-7-3-2-5-10-6-4-8-12-9-10/h2,4-6,8-9,11H,3,7H2,1H3/b5-2+
n/an/an/an/a>1.00E+6n/an/an/an/a
Abbott Laboratories
Curated by ChEMBL
Assay Description
Compound was evaluated for functional potencies and efficacies at rat Nicotinic acetylcholine receptor subtype PC12 (ganglionic)
J Med Chem 40: 4169-94 (1998)
Article DOI: 10.1021/jm970377o
BindingDB Entry DOI: 10.7270/Q2QF8TH9