BDBM50061613 CHEMBL3394164::US9321756, 17
SMILES: Nc1nnc(s1)-c1ccc2[nH]cc(-c3cncc(NC4CCCC4)n3)c2c1
InChI Key: InChIKey=QLNCUIUWMSXVLH-UHFFFAOYSA-N
Data: 8 IC50
Activity Spreadsheet -- Enzyme Inhibition Constant Data from BindingDB
Found 8 hits for monomerid = 50061613
Trg + Lig
Ki
nM
ΔG°
kcal/mole
IC50
nM
Kd
nM
EC50/IC50
nM
koff
s-1
kon
M-1s-1
pHTemp
°C
Serine/threonine-protein kinase pim-1
(Homo sapiens (Human))
BDBM50061613
(CHEMBL3394164 | US9321756, 17)
Show SMILES Nc1nnc(s1)-c1ccc2[nH]cc(-c3cncc(NC4CCCC4)n3)c2c1
Show InChI InChI=1S/C19H19N7S/c20-19-26-25-18(27-19)11-5-6-15-13(7-11)14(8-22-15)16-9-21-10-17(24-16)23-12-3-1-2-4-12/h5-10,12,22H,1-4H2,(H2,20,26)(H,23,24)
US Patent
n/an/a 1.50n/an/an/an/an/an/a
AMGEN INC.
US Patent
Assay Description
The assay for the determination of Pim activity is based on the formation of phosphorylated biotinylated-BAD peptide at the Serine 112 residue (S112)...
US Patent US9321756 (2016)
BindingDB Entry DOI: 10.7270/Q2W094S2
Serine/threonine-protein kinase pim-2
(Homo sapiens (Human))
BDBM50061613
(CHEMBL3394164 | US9321756, 17)
Show SMILES Nc1nnc(s1)-c1ccc2[nH]cc(-c3cncc(NC4CCCC4)n3)c2c1
Show InChI InChI=1S/C19H19N7S/c20-19-26-25-18(27-19)11-5-6-15-13(7-11)14(8-22-15)16-9-21-10-17(24-16)23-12-3-1-2-4-12/h5-10,12,22H,1-4H2,(H2,20,26)(H,23,24)
US Patent
n/an/a 5.92n/an/an/an/an/an/a
AMGEN INC.
US Patent
Assay Description
The assay for the determination of Pim activity is based on the formation of phosphorylated biotinylated-BAD peptide at the Serine 112 residue (S112)...
US Patent US9321756 (2016)
BindingDB Entry DOI: 10.7270/Q2W094S2
Serine/threonine-protein kinase pim-3
(Homo sapiens (Human))
BDBM50061613
(CHEMBL3394164 | US9321756, 17)
Show SMILES Nc1nnc(s1)-c1ccc2[nH]cc(-c3cncc(NC4CCCC4)n3)c2c1
Show InChI InChI=1S/C19H19N7S/c20-19-26-25-18(27-19)11-5-6-15-13(7-11)14(8-22-15)16-9-21-10-17(24-16)23-12-3-1-2-4-12/h5-10,12,22H,1-4H2,(H2,20,26)(H,23,24)
US Patent
n/an/a 0.763n/an/an/an/an/an/a
AMGEN INC.
US Patent
Assay Description
The assay for the determination of Pim activity is based on the formation of phosphorylated biotinylated-BAD peptide at the Serine 112 residue (S112)...
US Patent US9321756 (2016)
BindingDB Entry DOI: 10.7270/Q2W094S2
Serine/threonine-protein kinase pim-1
(Homo sapiens (Human))
BDBM50061613
(CHEMBL3394164 | US9321756, 17)
Show SMILES Nc1nnc(s1)-c1ccc2[nH]cc(-c3cncc(NC4CCCC4)n3)c2c1
Show InChI InChI=1S/C19H19N7S/c20-19-26-25-18(27-19)11-5-6-15-13(7-11)14(8-22-15)16-9-21-10-17(24-16)23-12-3-1-2-4-12/h5-10,12,22H,1-4H2,(H2,20,26)(H,23,24)
n/an/a 1n/an/an/an/an/an/a
Amgen Inc.
Curated by ChEMBL
Assay Description
Inhibition of full length recombinant PIM1 (unknown origin) using biotinylated-BAD peptide as substrate assessed as phosphorylation at serine 112 aft...
Bioorg Med Chem Lett 25: 775-80 (2015)
Article DOI: 10.1016/j.bmcl.2014.12.091
BindingDB Entry DOI: 10.7270/Q2WQ05G8
Serine/threonine-protein kinase pim-3
(Homo sapiens (Human))
BDBM50061613
(CHEMBL3394164 | US9321756, 17)
Show SMILES Nc1nnc(s1)-c1ccc2[nH]cc(-c3cncc(NC4CCCC4)n3)c2c1
Show InChI InChI=1S/C19H19N7S/c20-19-26-25-18(27-19)11-5-6-15-13(7-11)14(8-22-15)16-9-21-10-17(24-16)23-12-3-1-2-4-12/h5-10,12,22H,1-4H2,(H2,20,26)(H,23,24)
n/an/a 1n/an/an/an/an/an/a
Amgen Inc.
Curated by ChEMBL
Assay Description
Inhibition of full length recombinant PIM3 (unknown origin) using biotinylated-BAD peptide as substrate assessed as phosphorylation at serine 112 aft...
Bioorg Med Chem Lett 25: 775-80 (2015)
Article DOI: 10.1016/j.bmcl.2014.12.091
BindingDB Entry DOI: 10.7270/Q2WQ05G8
Serine/threonine-protein kinase pim-1
(Homo sapiens (Human))
BDBM50061613
(CHEMBL3394164 | US9321756, 17)
Show SMILES Nc1nnc(s1)-c1ccc2[nH]cc(-c3cncc(NC4CCCC4)n3)c2c1
Show InChI InChI=1S/C19H19N7S/c20-19-26-25-18(27-19)11-5-6-15-13(7-11)14(8-22-15)16-9-21-10-17(24-16)23-12-3-1-2-4-12/h5-10,12,22H,1-4H2,(H2,20,26)(H,23,24)
n/an/a 57n/an/an/an/an/an/a
Amgen Inc.
Curated by ChEMBL
Assay Description
Inhibition of PIM1 in human U2OS cells assessed as phosphorylation of BAD
Bioorg Med Chem Lett 25: 775-80 (2015)
Article DOI: 10.1016/j.bmcl.2014.12.091
BindingDB Entry DOI: 10.7270/Q2WQ05G8
Serine/threonine-protein kinase pim-2
(Homo sapiens (Human))
BDBM50061613
(CHEMBL3394164 | US9321756, 17)
Show SMILES Nc1nnc(s1)-c1ccc2[nH]cc(-c3cncc(NC4CCCC4)n3)c2c1
Show InChI InChI=1S/C19H19N7S/c20-19-26-25-18(27-19)11-5-6-15-13(7-11)14(8-22-15)16-9-21-10-17(24-16)23-12-3-1-2-4-12/h5-10,12,22H,1-4H2,(H2,20,26)(H,23,24)
n/an/a 1.22E+3n/an/an/an/an/an/a
Amgen Inc.
Curated by ChEMBL
Assay Description
Inhibition of PIM2 in human U2OS cells assessed as phosphorylation of BAD
Bioorg Med Chem Lett 25: 775-80 (2015)
Article DOI: 10.1016/j.bmcl.2014.12.091
BindingDB Entry DOI: 10.7270/Q2WQ05G8
Serine/threonine-protein kinase pim-2
(Homo sapiens (Human))
BDBM50061613
(CHEMBL3394164 | US9321756, 17)
Show SMILES Nc1nnc(s1)-c1ccc2[nH]cc(-c3cncc(NC4CCCC4)n3)c2c1
Show InChI InChI=1S/C19H19N7S/c20-19-26-25-18(27-19)11-5-6-15-13(7-11)14(8-22-15)16-9-21-10-17(24-16)23-12-3-1-2-4-12/h5-10,12,22H,1-4H2,(H2,20,26)(H,23,24)
n/an/a 6n/an/an/an/an/an/a
Amgen Inc.
Curated by ChEMBL
Assay Description
Inhibition of full length recombinant PIM2 (unknown origin) using biotinylated-BAD peptide as substrate assessed as phosphorylation at serine 112 aft...
Bioorg Med Chem Lett 25: 775-80 (2015)
Article DOI: 10.1016/j.bmcl.2014.12.091
BindingDB Entry DOI: 10.7270/Q2WQ05G8