null
SMILES: Cc1c(Sc2ccc(cc2)C2CCCCC2)n(COCCO)c(=O)[nH]c1=O
InChI Key: InChIKey=VOJUVMLIWDTFGL-UHFFFAOYSA-N
Activity Spreadsheet -- Enzyme Inhibition Constant Data from BindingDB
Found 1 hit for monomerid = 50061691
Trg + Lig
Ki
nM
ΔG°
kcal/mole
IC50
nM
Kd
nM
EC50/IC50
nM
koff
s-1
kon
M-1s-1
pHTemp
°C
Reverse transcriptase/RNaseH
(Human immunodeficiency virus 1)
BDBM50061691
(6-(4-Cyclohexyl-phenylsulfanyl)-1-(2-hydroxy-ethox...)
Show SMILES Cc1c(Sc2ccc(cc2)C2CCCCC2)n(COCCO)c(=O)[nH]c1=O
Show InChI InChI=1S/C20H26N2O4S/c1-14-18(24)21-20(25)22(13-26-12-11-23)19(14)27-17-9-7-16(8-10-17)15-5-3-2-4-6-15/h7-10,15,23H,2-6,11-13H2,1H3,(H,21,24,25)
n/an/an/an/a 3.50E+3n/an/an/an/a
Université d'Orléans
Curated by ChEMBL
Assay Description
Inhibitory concentration against HIV-1 reverse transcriptase
J Med Chem 40: 4257-64 (1998)
Article DOI: 10.1021/jm970110p
BindingDB Entry DOI: 10.7270/Q2WS8SC3