null
SMILES: CCCCS(=O)(=O)NC(CNC(=O)CCNC(=O)c1[nH]nc2cc(ccc12)C(N)=N)C(O)=O
InChI Key: InChIKey=ULMWVACPLANFSN-UHFFFAOYSA-N
Activity Spreadsheet -- Enzyme Inhibition Constant Data from BindingDB
Found 3 hits for monomerid = 50061859
Trg + Lig
Ki
nM
ΔG°
kcal/mole
IC50
nM
Kd
nM
EC50/IC50
nM
koff
s-1
kon
M-1s-1
pHTemp
°C
Integrin alpha-V/beta-3
(Homo sapiens (Human))
BDBM50061859
(2-(Butane-1-sulfonylamino)-3-{3-[(6-carbamimidoyl-...)
Show SMILES CCCCS(=O)(=O)NC(CNC(=O)CCNC(=O)c1[nH]nc2cc(ccc12)C(N)=N)C(O)=O
Show InChI InChI=1S/C19H27N7O6S/c1-2-3-8-33(31,32)26-14(19(29)30)10-23-15(27)6-7-22-18(28)16-12-5-4-11(17(20)21)9-13(12)24-25-16/h4-5,9,14,26H,2-3,6-8,10H2,1H3,(H3,20,21)(H,22,28)(H,23,27)(H,24,25)(H,29,30)
n/an/a>1.00E+5n/an/an/an/an/an/a
COR Therapeutics, Inc.
Curated by ChEMBL
Assay Description
Inhibition of vitronectin binding to the purified immobilized vitronectin receptor (alpha v, beta 3).
J Med Chem 40: 4308-18 (1998)
Article DOI: 10.1021/jm9704863
BindingDB Entry DOI: 10.7270/Q2HM57KW
Integrin alpha-IIb/beta-3
(Homo sapiens (Human))
BDBM50061859
(2-(Butane-1-sulfonylamino)-3-{3-[(6-carbamimidoyl-...)
Show SMILES CCCCS(=O)(=O)NC(CNC(=O)CCNC(=O)c1[nH]nc2cc(ccc12)C(N)=N)C(O)=O
Show InChI InChI=1S/C19H27N7O6S/c1-2-3-8-33(31,32)26-14(19(29)30)10-23-15(27)6-7-22-18(28)16-12-5-4-11(17(20)21)9-13(12)24-25-16/h4-5,9,14,26H,2-3,6-8,10H2,1H3,(H3,20,21)(H,22,28)(H,23,27)(H,24,25)(H,29,30)
n/an/a 53n/an/an/an/an/an/a
COR Therapeutics, Inc.
Curated by ChEMBL
Assay Description
Inhibition of platelet aggregation induced by 20 microM adenosine 5'-diphosphate (ADP) in human platelet rich plasma (h-PRP).
J Med Chem 40: 4308-18 (1998)
Article DOI: 10.1021/jm9704863
BindingDB Entry DOI: 10.7270/Q2HM57KW
Integrin alpha-IIb/beta-3
(Homo sapiens (Human))
BDBM50061859
(2-(Butane-1-sulfonylamino)-3-{3-[(6-carbamimidoyl-...)
Show SMILES CCCCS(=O)(=O)NC(CNC(=O)CCNC(=O)c1[nH]nc2cc(ccc12)C(N)=N)C(O)=O
Show InChI InChI=1S/C19H27N7O6S/c1-2-3-8-33(31,32)26-14(19(29)30)10-23-15(27)6-7-22-18(28)16-12-5-4-11(17(20)21)9-13(12)24-25-16/h4-5,9,14,26H,2-3,6-8,10H2,1H3,(H3,20,21)(H,22,28)(H,23,27)(H,24,25)(H,29,30)
n/an/a 2n/an/an/an/an/an/a
COR Therapeutics, Inc.
Curated by ChEMBL
Assay Description
Inhibitory activity of fibrinogen binding to purified immobilized glycoprotein (fibrinogen receptor).
J Med Chem 40: 4308-18 (1998)
Article DOI: 10.1021/jm9704863
BindingDB Entry DOI: 10.7270/Q2HM57KW