BDBM50061893 CHEMBL3394212
SMILES: NC1=N[C@@]2(CO1)c1cc(ccc1Oc1c(F)nc(cc21)-c1ccncc1)-c1cccnc1F
InChI Key: InChIKey=NQBWLDXCDRHLCJ-DEOSSOPVSA-N
Data: 1 KI  2 IC50
Activity Spreadsheet -- Enzyme Inhibition Constant Data from BindingDB
Found 3 hits for monomerid = 50061893
Trg + Lig
Ki
nM
ΔG°
kcal/mole
IC50
nM
Kd
nM
EC50/IC50
nM
koff
s-1
kon
M-1s-1
pHTemp
°C
Potassium voltage-gated channel subfamily H member 2
(Homo sapiens (Human))
BDBM50061893
(CHEMBL3394212)
Show SMILES NC1=N[C@@]2(CO1)c1cc(ccc1Oc1c(F)nc(cc21)-c1ccncc1)-c1cccnc1F |r,t:1|
Show InChI InChI=1S/C24H15F2N5O2/c25-21-15(2-1-7-29-21)14-3-4-19-16(10-14)24(12-32-23(27)31-24)17-11-18(13-5-8-28-9-6-13)30-22(26)20(17)33-19/h1-11H,12H2,(H2,27,31)/t24-/m0/s1
Reactome pathway
>1.50E+4n/an/an/an/an/an/an/an/a
Amgen Inc.
Curated by ChEMBL
Assay Description
Displacement of [3H]-dofetilide from human ERG expressed in HEK293 cell membranes after 90 mins by liquid scintillation counting method
ACS Med Chem Lett 6: 210-5 (2015)
Article DOI: 10.1021/ml500458t
BindingDB Entry DOI: 10.7270/Q2CN75JG
Beta-secretase 1
(Homo sapiens (Human))
BDBM50061893
(CHEMBL3394212)
Show SMILES NC1=N[C@@]2(CO1)c1cc(ccc1Oc1c(F)nc(cc21)-c1ccncc1)-c1cccnc1F |r,t:1|
Show InChI InChI=1S/C24H15F2N5O2/c25-21-15(2-1-7-29-21)14-3-4-19-16(10-14)24(12-32-23(27)31-24)17-11-18(13-5-8-28-9-6-13)30-22(26)20(17)33-19/h1-11H,12H2,(H2,27,31)/t24-/m0/s1
n/an/a 6n/an/an/an/an/an/a
Amgen Inc.
Curated by ChEMBL
Assay Description
Inhibition of BACE1 in HEK293 cells stably expressing APPSW assessed as reduction in Abeta40 level incubated overnight at 0.0005 to 10 uM by ELISA me...
ACS Med Chem Lett 6: 210-5 (2015)
Article DOI: 10.1021/ml500458t
BindingDB Entry DOI: 10.7270/Q2CN75JG
Beta-secretase 1
(Homo sapiens (Human))
BDBM50061893
(CHEMBL3394212)
Show SMILES NC1=N[C@@]2(CO1)c1cc(ccc1Oc1c(F)nc(cc21)-c1ccncc1)-c1cccnc1F |r,t:1|
Show InChI InChI=1S/C24H15F2N5O2/c25-21-15(2-1-7-29-21)14-3-4-19-16(10-14)24(12-32-23(27)31-24)17-11-18(13-5-8-28-9-6-13)30-22(26)20(17)33-19/h1-11H,12H2,(H2,27,31)/t24-/m0/s1
n/an/a 0.400n/an/an/an/an/an/a
Amgen Inc.
Curated by ChEMBL
Assay Description
Inhibition of human recombinant BACE1 pre-incubated with enzyme for 60 mins before fluorescent substrate addition FRET method
ACS Med Chem Lett 6: 210-5 (2015)
Article DOI: 10.1021/ml500458t
BindingDB Entry DOI: 10.7270/Q2CN75JG