BDBM50061988 CHEMBL138657::[(R)-1-((S)-1-Hydroxymethyl-2-phenyl-ethylcarbamoyl)-2-(1H-indol-3-yl)-1-methyl-ethyl]-carbamic acid adamantan-2-yl ester
SMILES: C[C@](Cc1c[nH]c2ccccc12)(NC(=O)OC1C2CC3CC(C2)CC1C3)C(=O)N[C@H](CO)Cc1ccccc1
InChI Key: InChIKey=KBKMKYDYLPDZRC-AUIJHKDYSA-N
Data: 1 KI  2 IC50
Activity Spreadsheet -- Enzyme Inhibition Constant Data from BindingDB
Found 3 hits for monomerid = 50061988
Trg + Lig
Ki
nM
ΔG°
kcal/mole
IC50
nM
Kd
nM
EC50/IC50
nM
koff
s-1
kon
M-1s-1
pHTemp
°C
Cholecystokinin receptor
(MOUSE)
BDBM50061988
(CHEMBL138657 | [(R)-1-((S)-1-Hydroxymethyl-2-pheny...)
Show SMILES C[C@](Cc1c[nH]c2ccccc12)(NC(=O)OC1C2CC3CC(C2)CC1C3)C(=O)N[C@H](CO)Cc1ccccc1 |wU:1.13,wD:29.33,1.0,TLB:25:24:22:19.18.20,THB:25:19:16.24.23:22,20:19:16:21.23.22,20:21:16:19.18.25,15:16:22:19.18.20,(-.04,-8.98,;-.02,-10.34,;.05,-11.88,;1.42,-12.58,;.17,-13.49,;.65,-14.96,;2.19,-14.95,;3.2,-16.09,;4.71,-15.77,;5.18,-14.3,;4.16,-13.18,;2.67,-13.49,;-1.41,-9.83,;-2.7,-10.68,;-2.67,-12.13,;-4.07,-9.99,;-5.36,-10.84,;-5.36,-12.37,;-6.76,-12.72,;-8.08,-12.23,;-9.28,-13.5,;-7.78,-13.08,;-6.38,-13.65,;-7.79,-11.5,;-6.75,-10.27,;-8.11,-10.75,;1.24,-9.66,;1.24,-8.29,;2.62,-10.35,;3.9,-9.5,;3.81,-7.96,;4.58,-6.63,;5.28,-10.19,;6.56,-9.34,;6.48,-7.96,;7.74,-6.96,;9.13,-7.63,;9.22,-9.17,;7.94,-10.03,)|
Show InChI InChI=1S/C32H39N3O4/c1-32(17-25-18-33-28-10-6-5-9-27(25)28,30(37)34-26(19-36)16-20-7-3-2-4-8-20)35-31(38)39-29-23-12-21-11-22(14-23)15-24(29)13-21/h2-10,18,21-24,26,29,33,36H,11-17,19H2,1H3,(H,34,37)(H,35,38)/t21?,22?,23?,24?,26-,29?,32+/m0/s1
Reactome pathway
6n/an/an/an/an/an/an/an/a
Parke-Davis Neuroscience Research Centre
Curated by ChEMBL
Assay Description
Cholecystokinin type B receptor binding assay performed on homogenized cerebral cortex from male mouse
J Med Chem 35: 1572-7 (1992)
BindingDB Entry DOI: 10.7270/Q26H4KM8
Cholecystokinin receptor
(RAT)
BDBM50061988
(CHEMBL138657 | [(R)-1-((S)-1-Hydroxymethyl-2-pheny...)
Show SMILES C[C@](Cc1c[nH]c2ccccc12)(NC(=O)OC1C2CC3CC(C2)CC1C3)C(=O)N[C@H](CO)Cc1ccccc1 |wU:1.13,wD:29.33,1.0,TLB:25:24:22:19.18.20,THB:25:19:16.24.23:22,20:19:16:21.23.22,20:21:16:19.18.25,15:16:22:19.18.20,(-.04,-8.98,;-.02,-10.34,;.05,-11.88,;1.42,-12.58,;.17,-13.49,;.65,-14.96,;2.19,-14.95,;3.2,-16.09,;4.71,-15.77,;5.18,-14.3,;4.16,-13.18,;2.67,-13.49,;-1.41,-9.83,;-2.7,-10.68,;-2.67,-12.13,;-4.07,-9.99,;-5.36,-10.84,;-5.36,-12.37,;-6.76,-12.72,;-8.08,-12.23,;-9.28,-13.5,;-7.78,-13.08,;-6.38,-13.65,;-7.79,-11.5,;-6.75,-10.27,;-8.11,-10.75,;1.24,-9.66,;1.24,-8.29,;2.62,-10.35,;3.9,-9.5,;3.81,-7.96,;4.58,-6.63,;5.28,-10.19,;6.56,-9.34,;6.48,-7.96,;7.74,-6.96,;9.13,-7.63,;9.22,-9.17,;7.94,-10.03,)|
Show InChI InChI=1S/C32H39N3O4/c1-32(17-25-18-33-28-10-6-5-9-27(25)28,30(37)34-26(19-36)16-20-7-3-2-4-8-20)35-31(38)39-29-23-12-21-11-22(14-23)15-24(29)13-21/h2-10,18,21-24,26,29,33,36H,11-17,19H2,1H3,(H,34,37)(H,35,38)/t21?,22?,23?,24?,26-,29?,32+/m0/s1
Reactome pathway
n/an/a 780n/an/an/an/an/an/a
Warner-Lambert Company
Curated by ChEMBL
Assay Description
Inhibitory concentration against radioligand [125I]Bolton-Hunter labeled CCK-8 to cholecystokinin type A receptor in the rat pancreas
J Med Chem 41: 38-45 (1998)
Article DOI: 10.1021/jm970065l
BindingDB Entry DOI: 10.7270/Q2GT5NV6
Cholecystokinin receptor
(MOUSE)
BDBM50061988
(CHEMBL138657 | [(R)-1-((S)-1-Hydroxymethyl-2-pheny...)
Show SMILES C[C@](Cc1c[nH]c2ccccc12)(NC(=O)OC1C2CC3CC(C2)CC1C3)C(=O)N[C@H](CO)Cc1ccccc1 |wU:1.13,wD:29.33,1.0,TLB:25:24:22:19.18.20,THB:25:19:16.24.23:22,20:19:16:21.23.22,20:21:16:19.18.25,15:16:22:19.18.20,(-.04,-8.98,;-.02,-10.34,;.05,-11.88,;1.42,-12.58,;.17,-13.49,;.65,-14.96,;2.19,-14.95,;3.2,-16.09,;4.71,-15.77,;5.18,-14.3,;4.16,-13.18,;2.67,-13.49,;-1.41,-9.83,;-2.7,-10.68,;-2.67,-12.13,;-4.07,-9.99,;-5.36,-10.84,;-5.36,-12.37,;-6.76,-12.72,;-8.08,-12.23,;-9.28,-13.5,;-7.78,-13.08,;-6.38,-13.65,;-7.79,-11.5,;-6.75,-10.27,;-8.11,-10.75,;1.24,-9.66,;1.24,-8.29,;2.62,-10.35,;3.9,-9.5,;3.81,-7.96,;4.58,-6.63,;5.28,-10.19,;6.56,-9.34,;6.48,-7.96,;7.74,-6.96,;9.13,-7.63,;9.22,-9.17,;7.94,-10.03,)|
Show InChI InChI=1S/C32H39N3O4/c1-32(17-25-18-33-28-10-6-5-9-27(25)28,30(37)34-26(19-36)16-20-7-3-2-4-8-20)35-31(38)39-29-23-12-21-11-22(14-23)15-24(29)13-21/h2-10,18,21-24,26,29,33,36H,11-17,19H2,1H3,(H,34,37)(H,35,38)/t21?,22?,23?,24?,26-,29?,32+/m0/s1
Reactome pathway
n/an/a 6.30n/an/an/an/an/an/a
Warner-Lambert Company
Curated by ChEMBL
Assay Description
Inhibitory concentration against radioligand [125I]Bolton-Hunter labeled CCK-8 to cholecystokinin type B receptor in the mouse cerebral cortex
J Med Chem 41: 38-45 (1998)
Article DOI: 10.1021/jm970065l
BindingDB Entry DOI: 10.7270/Q2GT5NV6