BDBM50062133 4-Methyl-piperidin-(2E)-ylideneamine::4-Methyl-piperidin-(2Z)-ylideneamine::CHEMBL6808
SMILES: CC1CCN=C(N)C1
InChI Key: InChIKey=GGDLOMFAKKVDPT-UHFFFAOYSA-N
Data: 8 IC50
Activity Spreadsheet -- Enzyme Inhibition Constant Data from BindingDB
Found 8 hits for monomerid = 50062133
Trg + Lig
Ki
nM
ΔG°
kcal/mole
IC50
nM
Kd
nM
EC50/IC50
nM
koff
s-1
kon
M-1s-1
pHTemp
°C
Nitric oxide synthase, inducible
(Homo sapiens (Human))
BDBM50062133
(4-Methyl-piperidin-(2E)-ylideneamine | 4-Methyl-pi...)
Show SMILES CC1CCN=C(N)C1 |t:4|
Show InChI InChI=1S/C6H12N2/c1-5-2-3-8-6(7)4-5/h5H,2-4H2,1H3,(H2,7,8)
NCI pathway
Reactome pathway
n/an/a 100n/an/an/an/an/an/a
G. D. Searle Research and Development
Curated by ChEMBL
Assay Description
Inhibition of human Inducible nitric oxide synthase
J Med Chem 41: 96-101 (1998)
Article DOI: 10.1021/jm9705059
BindingDB Entry DOI: 10.7270/Q2GM86D2
Nitric oxide synthase, endothelial
(Homo sapiens (Human))
BDBM50062133
(4-Methyl-piperidin-(2E)-ylideneamine | 4-Methyl-pi...)
Show SMILES CC1CCN=C(N)C1 |t:4|
Show InChI InChI=1S/C6H12N2/c1-5-2-3-8-6(7)4-5/h5H,2-4H2,1H3,(H2,7,8)
n/an/a 1.10E+3n/an/an/an/an/an/a
G. D. Searle Research and Development
Curated by ChEMBL
Assay Description
inhibition of human endothelial constitutive Endothelial nitric oxide synthase (heNOS)
J Med Chem 41: 96-101 (1998)
Article DOI: 10.1021/jm9705059
BindingDB Entry DOI: 10.7270/Q2GM86D2
Nitric oxide synthase, brain
(Homo sapiens (Human))
BDBM50062133
(4-Methyl-piperidin-(2E)-ylideneamine | 4-Methyl-pi...)
Show SMILES CC1CCN=C(N)C1 |t:4|
Show InChI InChI=1S/C6H12N2/c1-5-2-3-8-6(7)4-5/h5H,2-4H2,1H3,(H2,7,8)
Reactome pathway
n/an/a 200n/an/an/an/an/an/a
G. D. Searle Research and Development
Curated by ChEMBL
Assay Description
Inhibition of human Neuronal nitric oxide synthase
J Med Chem 41: 96-101 (1998)
Article DOI: 10.1021/jm9705059
BindingDB Entry DOI: 10.7270/Q2GM86D2
Nitric oxide synthase, inducible
(Homo sapiens (Human))
BDBM50062133
(4-Methyl-piperidin-(2E)-ylideneamine | 4-Methyl-pi...)
Show SMILES CC1CCN=C(N)C1 |t:4|
Show InChI InChI=1S/C6H12N2/c1-5-2-3-8-6(7)4-5/h5H,2-4H2,1H3,(H2,7,8)
NCI pathway
Reactome pathway
n/an/a 37n/an/an/an/an/an/a
Merck Research Laboratories
Curated by ChEMBL
Assay Description
Inhibitory activity against human Inducible nitric oxide synthase (iNOS)
Bioorg Med Chem Lett 15: 1997-2001 (2005)
Article DOI: 10.1016/j.bmcl.2005.02.067
BindingDB Entry DOI: 10.7270/Q2XK8F3M
Nitric oxide synthase, endothelial
(Homo sapiens (Human))
BDBM50062133
(4-Methyl-piperidin-(2E)-ylideneamine | 4-Methyl-pi...)
Show SMILES CC1CCN=C(N)C1 |t:4|
Show InChI InChI=1S/C6H12N2/c1-5-2-3-8-6(7)4-5/h5H,2-4H2,1H3,(H2,7,8)
n/an/a 220n/an/an/an/an/an/a
Merck Research Laboratories Rahway
Curated by ChEMBL
Assay Description
Inhibitory activity against endothelial nitric oxide synthase (eNOS)
Bioorg Med Chem Lett 10: 1975-8 (2001)
BindingDB Entry DOI: 10.7270/Q2319V30
Nitric oxide synthase, brain
(Homo sapiens (Human))
BDBM50062133
(4-Methyl-piperidin-(2E)-ylideneamine | 4-Methyl-pi...)
Show SMILES CC1CCN=C(N)C1 |t:4|
Show InChI InChI=1S/C6H12N2/c1-5-2-3-8-6(7)4-5/h5H,2-4H2,1H3,(H2,7,8)
Reactome pathway
n/an/a 16n/an/an/an/an/an/a
Merck Research Laboratories
Curated by ChEMBL
Assay Description
Inhibitory activity against human Neuronal nitric oxide synthase (nNOS)
Bioorg Med Chem Lett 15: 1997-2001 (2005)
Article DOI: 10.1016/j.bmcl.2005.02.067
BindingDB Entry DOI: 10.7270/Q2XK8F3M
Nitric oxide synthase, endothelial
(Homo sapiens (Human))
BDBM50062133
(4-Methyl-piperidin-(2E)-ylideneamine | 4-Methyl-pi...)
Show SMILES CC1CCN=C(N)C1 |t:4|
Show InChI InChI=1S/C6H12N2/c1-5-2-3-8-6(7)4-5/h5H,2-4H2,1H3,(H2,7,8)
n/an/a 146n/an/an/an/an/an/a
Merck Research Laboratories
Curated by ChEMBL
Assay Description
Inhibitory activity against human Endothelial nitric oxide synthase (eNOS)
Bioorg Med Chem Lett 15: 1997-2001 (2005)
Article DOI: 10.1016/j.bmcl.2005.02.067
BindingDB Entry DOI: 10.7270/Q2XK8F3M
Nitric oxide synthase, inducible
(Homo sapiens (Human))
BDBM50062133
(4-Methyl-piperidin-(2E)-ylideneamine | 4-Methyl-pi...)
Show SMILES CC1CCN=C(N)C1 |t:4|
Show InChI InChI=1S/C6H12N2/c1-5-2-3-8-6(7)4-5/h5H,2-4H2,1H3,(H2,7,8)
NCI pathway
Reactome pathway
n/an/a 16n/an/an/an/an/an/a
Merck Research Laboratories Rahway
Curated by ChEMBL
Assay Description
Inhibitory activity against inducible nitric oxide synthase (iNOS)
Bioorg Med Chem Lett 10: 1975-8 (2001)
BindingDB Entry DOI: 10.7270/Q2319V30