BDBM50062146 CHEMBL3397065
SMILES: COC(=O)CCCc1ccc(O)c(O)c1
InChI Key: InChIKey=UCPMAHTVVPYWPV-UHFFFAOYSA-N
Data: 1 IC50
Activity Spreadsheet -- Enzyme Inhibition Constant Data from BindingDB
Found 1 hit for monomerid = 50062146
Trg + Lig
Ki
nM
ΔG°
kcal/mole
IC50
nM
Kd
nM
EC50/IC50
nM
koff
s-1
kon
M-1s-1
pHTemp
°C
2-heptyl-4(1H)-quinolone synthase PqsD
(Pseudomonas aeruginosa)
BDBM50062146
(CHEMBL3397065)
Show SMILES COC(=O)CCCc1ccc(O)c(O)c1
Show InChI InChI=1S/C11H14O4/c1-15-11(14)4-2-3-8-5-6-9(12)10(13)7-8/h5-7,12-13H,2-4H2,1H3
n/an/a 7.90E+3n/an/an/an/an/an/a
Institute for Pharmaceutical Research Saarland (HIPS)
Curated by ChEMBL
Assay Description
Inhibition of Pseudomonas aeruginosa recombinant PqsD expressed in Escherichia coli BL21 (lambdaDE3) using ACoA/beta-ketodecanoic acid as substrate a...
Eur J Med Chem 90: 351-9 (2015)
Article DOI: 10.1016/j.ejmech.2014.11.055
BindingDB Entry DOI: 10.7270/Q20G3MV7