BDBM50062423 5-(3,4-Dichloro-phenyl)-2,2,4-trimethyl-2,5-dihydro-1H-6-oxa-1-aza-chrysene::CHEMBL317921
SMILES: CC1=CC(C)(C)Nc2ccc3-c4ccccc4OC(c4ccc(Cl)c(Cl)c4)c3c12
InChI Key: InChIKey=GAUXDXUKQPFNPK-UHFFFAOYSA-N
Data: 3 KI  4 IC50  1 EC50
Activity Spreadsheet -- Enzyme Inhibition Constant Data from BindingDB
Found 8 hits for monomerid = 50062423
Trg + Lig
Ki
nM
ΔG°
kcal/mole
IC50
nM
Kd
nM
EC50/IC50
nM
koff
s-1
kon
M-1s-1
pHTemp
°C
Progesterone receptor
(Homo sapiens (Human))
BDBM50062423
(5-(3,4-Dichloro-phenyl)-2,2,4-trimethyl-2,5-dihydr...)
Show SMILES CC1=CC(C)(C)Nc2ccc3-c4ccccc4OC(c4ccc(Cl)c(Cl)c4)c3c12 |t:1|
Show InChI InChI=1S/C25H21Cl2NO/c1-14-13-25(2,3)28-20-11-9-17-16-6-4-5-7-21(16)29-24(23(17)22(14)20)15-8-10-18(26)19(27)12-15/h4-13,24,28H,1-3H3
3.40n/an/an/an/an/an/an/an/a
Ligand Pharmaceuticals, Inc.
Curated by ChEMBL
Assay Description
The binding affinity of the compound was determined on Human progesterone receptor (hPR-A) using progesterone as radioligand.
J Med Chem 41: 291-302 (1998)
Article DOI: 10.1021/jm9705768
BindingDB Entry DOI: 10.7270/Q29W0DMD
Glucocorticoid receptor
(Homo sapiens (Human))
BDBM50062423
(5-(3,4-Dichloro-phenyl)-2,2,4-trimethyl-2,5-dihydr...)
Show SMILES CC1=CC(C)(C)Nc2ccc3-c4ccccc4OC(c4ccc(Cl)c(Cl)c4)c3c12 |t:1|
Show InChI InChI=1S/C25H21Cl2NO/c1-14-13-25(2,3)28-20-11-9-17-16-6-4-5-7-21(16)29-24(23(17)22(14)20)15-8-10-18(26)19(27)12-15/h4-13,24,28H,1-3H3
59n/an/an/an/an/an/an/an/a
Ligand Pharmaceuticals, Inc.
Curated by ChEMBL
Assay Description
Binding affinity was determined on Human glucocorticoid receptor (hAR) using progesterone as radioligand.
J Med Chem 41: 291-302 (1998)
Article DOI: 10.1021/jm9705768
BindingDB Entry DOI: 10.7270/Q29W0DMD
Androgen Receptor
(Homo sapiens (Human))
BDBM50062423
(5-(3,4-Dichloro-phenyl)-2,2,4-trimethyl-2,5-dihydr...)
Show SMILES CC1=CC(C)(C)Nc2ccc3-c4ccccc4OC(c4ccc(Cl)c(Cl)c4)c3c12 |t:1|
Show InChI InChI=1S/C25H21Cl2NO/c1-14-13-25(2,3)28-20-11-9-17-16-6-4-5-7-21(16)29-24(23(17)22(14)20)15-8-10-18(26)19(27)12-15/h4-13,24,28H,1-3H3
NCI pathway
Reactome pathway
5.83E+3n/an/an/an/an/an/an/an/a
Ligand Pharmaceuticals, Inc.
Curated by ChEMBL
Assay Description
Binding affinity was determined on Human androgen receptor (hAR) using progesterone as radioligand.
J Med Chem 41: 291-302 (1998)
Article DOI: 10.1021/jm9705768
BindingDB Entry DOI: 10.7270/Q29W0DMD
Androgen Receptor
(Homo sapiens (Human))
BDBM50062423
(5-(3,4-Dichloro-phenyl)-2,2,4-trimethyl-2,5-dihydr...)
Show SMILES CC1=CC(C)(C)Nc2ccc3-c4ccccc4OC(c4ccc(Cl)c(Cl)c4)c3c12 |t:1|
Show InChI InChI=1S/C25H21Cl2NO/c1-14-13-25(2,3)28-20-11-9-17-16-6-4-5-7-21(16)29-24(23(17)22(14)20)15-8-10-18(26)19(27)12-15/h4-13,24,28H,1-3H3
NCI pathway
Reactome pathway
n/an/a 946n/an/an/an/an/an/a
Ligand Pharmaceuticals, Inc.
Curated by ChEMBL
Assay Description
Antagonistic activity was determined in Human androgen receptor(hAR) of CV-1 cells in cotransfection assay.
J Med Chem 41: 291-302 (1998)
Article DOI: 10.1021/jm9705768
BindingDB Entry DOI: 10.7270/Q29W0DMD
Mineralocorticoid receptor
(Homo sapiens (Human))
BDBM50062423
(5-(3,4-Dichloro-phenyl)-2,2,4-trimethyl-2,5-dihydr...)
Show SMILES CC1=CC(C)(C)Nc2ccc3-c4ccccc4OC(c4ccc(Cl)c(Cl)c4)c3c12 |t:1|
Show InChI InChI=1S/C25H21Cl2NO/c1-14-13-25(2,3)28-20-11-9-17-16-6-4-5-7-21(16)29-24(23(17)22(14)20)15-8-10-18(26)19(27)12-15/h4-13,24,28H,1-3H3
n/an/a 1.06E+3n/an/an/an/an/an/a
Ligand Pharmaceuticals, Inc.
Curated by ChEMBL
Assay Description
Antagonistic activity was determined in Human mineralocorticoid receptor(hMR) of CV-1 cells in cotransfection assay.
J Med Chem 41: 291-302 (1998)
Article DOI: 10.1021/jm9705768
BindingDB Entry DOI: 10.7270/Q29W0DMD
Progesterone receptor
(Homo sapiens (Human))
BDBM50062423
(5-(3,4-Dichloro-phenyl)-2,2,4-trimethyl-2,5-dihydr...)
Show SMILES CC1=CC(C)(C)Nc2ccc3-c4ccccc4OC(c4ccc(Cl)c(Cl)c4)c3c12 |t:1|
Show InChI InChI=1S/C25H21Cl2NO/c1-14-13-25(2,3)28-20-11-9-17-16-6-4-5-7-21(16)29-24(23(17)22(14)20)15-8-10-18(26)19(27)12-15/h4-13,24,28H,1-3H3
n/an/an/an/a 18n/an/an/an/a
Ligand Pharmaceuticals, Inc.
Curated by ChEMBL
Assay Description
Agonistic activity to the human progesterone receptor(hPR)assayed in CV-1 cells in cotransfection assay.
J Med Chem 41: 291-302 (1998)
Article DOI: 10.1021/jm9705768
BindingDB Entry DOI: 10.7270/Q29W0DMD
Progesterone receptor
(Homo sapiens (Human))
BDBM50062423
(5-(3,4-Dichloro-phenyl)-2,2,4-trimethyl-2,5-dihydr...)
Show SMILES CC1=CC(C)(C)Nc2ccc3-c4ccccc4OC(c4ccc(Cl)c(Cl)c4)c3c12 |t:1|
Show InChI InChI=1S/C25H21Cl2NO/c1-14-13-25(2,3)28-20-11-9-17-16-6-4-5-7-21(16)29-24(23(17)22(14)20)15-8-10-18(26)19(27)12-15/h4-13,24,28H,1-3H3
n/an/a 720n/an/an/an/an/an/a
Ligand Pharmaceuticals, Inc.
Curated by ChEMBL
Assay Description
Antagonistic activity was determined in Human progesterone receptor(hPR) of CV-1 cells in cotransfection assay.
J Med Chem 41: 291-302 (1998)
Article DOI: 10.1021/jm9705768
BindingDB Entry DOI: 10.7270/Q29W0DMD
Glucocorticoid receptor
(Homo sapiens (Human))
BDBM50062423
(5-(3,4-Dichloro-phenyl)-2,2,4-trimethyl-2,5-dihydr...)
Show SMILES CC1=CC(C)(C)Nc2ccc3-c4ccccc4OC(c4ccc(Cl)c(Cl)c4)c3c12 |t:1|
Show InChI InChI=1S/C25H21Cl2NO/c1-14-13-25(2,3)28-20-11-9-17-16-6-4-5-7-21(16)29-24(23(17)22(14)20)15-8-10-18(26)19(27)12-15/h4-13,24,28H,1-3H3
n/an/a 80n/an/an/an/an/an/a
Ligand Pharmaceuticals, Inc.
Curated by ChEMBL
Assay Description
Antagonistic activity was determined in Human glucocorticoid receptor(hGR) of CV-1 cells in cotransfection assay.
J Med Chem 41: 291-302 (1998)
Article DOI: 10.1021/jm9705768
BindingDB Entry DOI: 10.7270/Q29W0DMD