BDBM50062434 9-Chloro-5-(4-fluoro-3-methyl-phenyl)-2,2,4-trimethyl-2,5-dihydro-1H-6-oxa-1-aza-chrysene::CHEMBL104347
SMILES: CC1=CC(C)(C)Nc2ccc3-c4cc(Cl)ccc4OC(c4ccc(F)c(C)c4)c3c12
InChI Key: InChIKey=JSHHKDQSFNGJMA-UHFFFAOYSA-N
Data: 1 KI  1 EC50
Activity Spreadsheet -- Enzyme Inhibition Constant Data from BindingDB
Found 2 hits for monomerid = 50062434
Trg + Lig
Ki
nM
ΔG°
kcal/mole
IC50
nM
Kd
nM
EC50/IC50
nM
koff
s-1
kon
M-1s-1
pHTemp
°C
Progesterone receptor
(Homo sapiens (Human))
BDBM50062434
(9-Chloro-5-(4-fluoro-3-methyl-phenyl)-2,2,4-trimet...)
Show SMILES CC1=CC(C)(C)Nc2ccc3-c4cc(Cl)ccc4OC(c4ccc(F)c(C)c4)c3c12 |t:1|
Show InChI InChI=1S/C26H23ClFNO/c1-14-11-16(5-8-20(14)28)25-24-18(19-12-17(27)6-10-22(19)30-25)7-9-21-23(24)15(2)13-26(3,4)29-21/h5-13,25,29H,1-4H3
1.30n/an/an/an/an/an/an/an/a
Ligand Pharmaceuticals, Inc.
Curated by ChEMBL
Assay Description
The binding affinity measured using baculovirus-expressed hPR-A in sf21 cells.
J Med Chem 41: 303-10 (1998)
Article DOI: 10.1021/jm9705770
BindingDB Entry DOI: 10.7270/Q2RV0PC8
Progesterone receptor
(Homo sapiens (Human))
BDBM50062434
(9-Chloro-5-(4-fluoro-3-methyl-phenyl)-2,2,4-trimet...)
Show SMILES CC1=CC(C)(C)Nc2ccc3-c4cc(Cl)ccc4OC(c4ccc(F)c(C)c4)c3c12 |t:1|
Show InChI InChI=1S/C26H23ClFNO/c1-14-11-16(5-8-20(14)28)25-24-18(19-12-17(27)6-10-22(19)30-25)7-9-21-23(24)15(2)13-26(3,4)29-21/h5-13,25,29H,1-4H3
n/an/an/an/a 9.5n/an/an/an/a
Ligand Pharmaceuticals, Inc.
Curated by ChEMBL
Assay Description
Agonistic activity was measured for modulation of hPR-B (human progesterone receptor) in co-transfected CV-1 cells.
J Med Chem 41: 303-10 (1998)
Article DOI: 10.1021/jm9705770
BindingDB Entry DOI: 10.7270/Q2RV0PC8