BDBM50062661 2-Chloro-4-trifluoromethyl-pyrimidine-5-carboxylic acid (3,5-dichloro-phenyl)-amide::CHEMBL334485
SMILES: FC(F)(F)c1nc(Cl)ncc1C(=O)Nc1cc(Cl)cc(Cl)c1
InChI Key: InChIKey=NLRGWKVQZPYNNM-UHFFFAOYSA-N
Data: 2 IC50
Activity Spreadsheet -- Enzyme Inhibition Constant Data from BindingDB
Found 2 hits for monomerid = 50062661
Trg + Lig
Ki
nM
ΔG°
kcal/mole
IC50
nM
Kd
nM
EC50/IC50
nM
koff
s-1
kon
M-1s-1
pHTemp
°C
Nuclear factor NF-kappa-B (NF-kB)
(Homo sapiens (Human))
BDBM50062661
(2-Chloro-4-trifluoromethyl-pyrimidine-5-carboxylic...)
Show SMILES FC(F)(F)c1nc(Cl)ncc1C(=O)Nc1cc(Cl)cc(Cl)c1
Show InChI InChI=1S/C12H5Cl3F3N3O/c13-5-1-6(14)3-7(2-5)20-10(22)8-4-19-11(15)21-9(8)12(16,17)18/h1-4H,(H,20,22)
n/an/a 500n/an/an/an/an/an/a
Signal Pharmaceuticals, Inc.
Curated by ChEMBL
Assay Description
In vitro inhibitory activity against human Jurkat T-Cells stably transfected with an Nuclear factor kappa B transcription factor
J Med Chem 41: 413-9 (1998)
Article DOI: 10.1021/jm970671g
BindingDB Entry DOI: 10.7270/Q2P55MMZ
Activating transcription factor 1
(Homo sapiens (Human))
BDBM50062661
(2-Chloro-4-trifluoromethyl-pyrimidine-5-carboxylic...)
Show SMILES FC(F)(F)c1nc(Cl)ncc1C(=O)Nc1cc(Cl)cc(Cl)c1
Show InChI InChI=1S/C12H5Cl3F3N3O/c13-5-1-6(14)3-7(2-5)20-10(22)8-4-19-11(15)21-9(8)12(16,17)18/h1-4H,(H,20,22)
NCI pathway
Reactome pathway
n/an/a 500n/an/an/an/an/an/a
Signal Pharmaceuticals, Inc.
Curated by ChEMBL
Assay Description
In vitro inhibitory activity against human Jurkat T-Cells stably transfected with activating transcription factor 1
J Med Chem 41: 413-9 (1998)
Article DOI: 10.1021/jm970671g
BindingDB Entry DOI: 10.7270/Q2P55MMZ