BDBM50063007 CHEMBL3398096
SMILES: COc1ccccc1NC(=O)Cn1ccc(=O)n(Cc2cc(C)cc(C)c2)c1=O
InChI Key: InChIKey=HBXVIZVIKRGRSH-UHFFFAOYSA-N
Data: 1 IC50
Activity Spreadsheet -- Enzyme Inhibition Constant Data from BindingDB
Found 1 hit for monomerid = 50063007
Trg + Lig
Ki
nM
ΔG°
kcal/mole
IC50
nM
Kd
nM
EC50/IC50
nM
koff
s-1
kon
M-1s-1
pHTemp
°C
Reverse transcriptase
(Human immunodeficiency virus 1)
BDBM50063007
(CHEMBL3398096)
Show SMILES COc1ccccc1NC(=O)Cn1ccc(=O)n(Cc2cc(C)cc(C)c2)c1=O
Show InChI InChI=1S/C22H23N3O4/c1-15-10-16(2)12-17(11-15)13-25-21(27)8-9-24(22(25)28)14-20(26)23-18-6-4-5-7-19(18)29-3/h4-12H,13-14H2,1-3H3,(H,23,26)
n/an/a 2.11E+5n/an/an/an/an/an/a
Volgograd State Medical University
Curated by ChEMBL
Assay Description
Inhibition of HIV1 recombinant wild type reverse transcriptase p66/p51 pre-incubated with compound before enzyme addition using poly(rA) template and...
Bioorg Med Chem 23: 1069-81 (2015)
Article DOI: 10.1016/j.bmc.2015.01.002
BindingDB Entry DOI: 10.7270/Q2RR20XW