BDBM50063048 CHEMBL3398147
SMILES: CC(C)(C)C(=O)Oc1ccc(cc1)S(=O)(=O)Nc1ccccc1C=O
InChI Key: InChIKey=UOIHXXCRGILGCH-UHFFFAOYSA-N
Data: 3 IC50
Activity Spreadsheet -- Enzyme Inhibition Constant Data from BindingDB
Found 3 hits for monomerid = 50063048
Trg + Lig
Ki
nM
ΔG°
kcal/mole
IC50
nM
Kd
nM
EC50/IC50
nM
koff
s-1
kon
M-1s-1
pHTemp
°C
Leukocyte elastase
(Homo sapiens (Human))
BDBM50063048
(CHEMBL3398147)
Show SMILES CC(C)(C)C(=O)Oc1ccc(cc1)S(=O)(=O)Nc1ccccc1C=O
Show InChI InChI=1S/C18H19NO5S/c1-18(2,3)17(21)24-14-8-10-15(11-9-14)25(22,23)19-16-7-5-4-6-13(16)12-20/h4-12,19H,1-3H3
Reactome pathway
n/an/a 12n/an/an/an/an/an/a
Chang Gung University
Curated by ChEMBL
Assay Description
Inhibition of human neutrophil elastase measured for 30 mins by spectrophotometry
Bioorg Med Chem 23: 1123-34 (2015)
Article DOI: 10.1016/j.bmc.2014.12.056
BindingDB Entry DOI: 10.7270/Q2CJ8G5M
Cathepsin G
(Homo sapiens (Human))
BDBM50063048
(CHEMBL3398147)
Show SMILES CC(C)(C)C(=O)Oc1ccc(cc1)S(=O)(=O)Nc1ccccc1C=O
Show InChI InChI=1S/C18H19NO5S/c1-18(2,3)17(21)24-14-8-10-15(11-9-14)25(22,23)19-16-7-5-4-6-13(16)12-20/h4-12,19H,1-3H3
NCI pathway
Reactome pathway
n/an/a>1n/an/an/an/an/an/a
Chang Gung University
Curated by ChEMBL
Assay Description
Inhibition of human cathepsin G using N-succinyl-Ala-Ala-Pro-Phe-p-nitroanilide as substrate measured for 180 mins by spectrophotometry
Bioorg Med Chem 23: 1123-34 (2015)
Article DOI: 10.1016/j.bmc.2014.12.056
BindingDB Entry DOI: 10.7270/Q2CJ8G5M
Leukocyte proteinase 3
(Homo sapiens (Human))
BDBM50063048
(CHEMBL3398147)
Show SMILES CC(C)(C)C(=O)Oc1ccc(cc1)S(=O)(=O)Nc1ccccc1C=O
Show InChI InChI=1S/C18H19NO5S/c1-18(2,3)17(21)24-14-8-10-15(11-9-14)25(22,23)19-16-7-5-4-6-13(16)12-20/h4-12,19H,1-3H3
NCI pathway
Reactome pathway
n/an/a 205n/an/an/an/an/an/a
Chang Gung University
Curated by ChEMBL
Assay Description
Inhibition of Pr3 (unknown origin) using t-butyloxycarbonyl-Ala-Ala-Nva-thiobenzyl ester as substrate measured for 180 mins by spectrophotometry
Bioorg Med Chem 23: 1123-34 (2015)
Article DOI: 10.1016/j.bmc.2014.12.056
BindingDB Entry DOI: 10.7270/Q2CJ8G5M