BDBM50063674 CHEMBL3397327
SMILES: N[C@@H](CCSC[C@H]1O[C@H]([C@H](O)[C@@H]1O)n1cnc2c(N)ncnc12)C(=O)NCc1cc2CN(Cc3ccccc3)CCn2n1
InChI Key: InChIKey=UOHKGDRZRXXKGI-BKPJCRJXSA-N
Data: 1 IC50
Activity Spreadsheet -- Enzyme Inhibition Constant Data from BindingDB
Found 1 hit for monomerid = 50063674
Trg + Lig
Ki
nM
ΔG°
kcal/mole
IC50
nM
Kd
nM
EC50/IC50
nM
koff
s-1
kon
M-1s-1
pHTemp
°C
Histone-lysine N-methyltransferase EZH2
(Homo sapiens (Human))
BDBM50063674
(CHEMBL3397327)
Show SMILES N[C@@H](CCSC[C@H]1O[C@H]([C@H](O)[C@@H]1O)n1cnc2c(N)ncnc12)C(=O)NCc1cc2CN(Cc3ccccc3)CCn2n1 |r|
Show InChI InChI=1S/C28H36N10O4S/c29-20(27(41)31-11-18-10-19-13-36(7-8-38(19)35-18)12-17-4-2-1-3-5-17)6-9-43-14-21-23(39)24(40)28(42-21)37-16-34-22-25(30)32-15-33-26(22)37/h1-5,10,15-16,20-21,23-24,28,39-40H,6-9,11-14,29H2,(H,31,41)(H2,30,32,33)/t20-,21+,23+,24+,28+/m0/s1
n/an/a 8.00E+3n/an/an/an/an/an/a
Pfizer Inc.
Curated by ChEMBL
Assay Description
Inhibition of N-terminally FLAG-tagged wild type EZH2 in EZH2/SUZ12/EED/RbAp48 complex (unknown origin) expressed in baculovirus infected in SF9 cell...
Bioorg Med Chem Lett 25: 1532-7 (2015)
Article DOI: 10.1016/j.bmcl.2015.02.017
BindingDB Entry DOI: 10.7270/Q2TM7CSS