BDBM50063679 CHEMBL3397320
SMILES: CCn1cc(CNC(=O)[C@@H](N)CCSC[C@H]2O[C@H]([C@H](O)[C@@H]2O)n2cnc3c(N)ncnc23)cn1
InChI Key: InChIKey=NPHWQHJVJMDKDU-WUMBASEESA-N
Data: 1 IC50
Activity Spreadsheet -- Enzyme Inhibition Constant Data from BindingDB
Found 1 hit for monomerid = 50063679
Trg + Lig
Ki
nM
ΔG°
kcal/mole
IC50
nM
Kd
nM
EC50/IC50
nM
koff
s-1
kon
M-1s-1
pHTemp
°C
Histone-lysine N-methyltransferase EZH2
(Homo sapiens (Human))
BDBM50063679
(CHEMBL3397320)
Show SMILES CCn1cc(CNC(=O)[C@@H](N)CCSC[C@H]2O[C@H]([C@H](O)[C@@H]2O)n2cnc3c(N)ncnc23)cn1 |r|
Show InChI InChI=1S/C20H29N9O4S/c1-2-28-7-11(6-27-28)5-23-19(32)12(21)3-4-34-8-13-15(30)16(31)20(33-13)29-10-26-14-17(22)24-9-25-18(14)29/h6-7,9-10,12-13,15-16,20,30-31H,2-5,8,21H2,1H3,(H,23,32)(H2,22,24,25)/t12-,13+,15+,16+,20+/m0/s1
n/an/a 5.00E+4n/an/an/an/an/an/a
Pfizer Inc.
Curated by ChEMBL
Assay Description
Inhibition of N-terminally FLAG-tagged wild type EZH2 in EZH2/SUZ12/EED/RbAp48 complex (unknown origin) expressed in baculovirus infected in SF9 cell...
Bioorg Med Chem Lett 25: 1532-7 (2015)
Article DOI: 10.1016/j.bmcl.2015.02.017
BindingDB Entry DOI: 10.7270/Q2TM7CSS